3-Acetoxycinnamic acid
- Formula: C11H10O4
- Molecular weight: 206.1947
- IUPAC Standard InChIKey: LSZKRNUEKNCZIE-AATRIKPKSA-N
- CAS Registry Number: 20375-42-2
- Chemical structure:
View 3d structure (requires JavaScript / HTML 5) - Other names: m-Acetyl coumaric acid

Condensed phase thermochemistry data

Data compiled by: Hussein Y. Afeefy, Joel F. Liebman, and Stephen E. Stein
Quantity | Value | Units | Method | Reference | Comment |
---|---|---|---|---|---|
ΔcH°solid | -5062.51 | kJ/mol | Ccb | Verkade, 1926 | Corresponding ΔfHºsolid = -695.25 kJ/mol (simple calculation by NIST; no Washburn corrections) |

References

Verkade, 1926
Verkade, P.E.,
Verbrandingswarmten van plaatsings-isomere benzol-derivaten en de theorie der geinduceerde alterneeren de polatiteit,
Verslag Akad. Wetenschappen Amsterdam, 1926, 35, 492-504. [all data]