4H-Cyclopenta[def]phenanthrene
- Formula: C15H10
- Molecular weight: 190.2399
- IUPAC Standard InChIKey: RKZDZWJDQTZDLD-UHFFFAOYSA-N
- CAS Registry Number: 203-64-5
- Chemical structure:
View 3d structure (requires JavaScript / HTML 5) - Other names: Benzo[def]fluorene; Methane, 4,5-phenanthrylene-; Methylenephenanthrene; Phenanthrene, 4,5-methylene-; 4,5-Methylenephenanthrene; 4,5-Phenanthrylenemethane; Cyclopenta[def]phenanthrene; NSC 88888; 4H-Cyclopenta[def]phenathrene; 4H-Cyclopenta[drf]phenanthrene

Gas phase thermochemistry data

Data compiled by: Glushko Thermocenter, Russian Academy of Sciences, Moscow
Constant pressure heat capacity of gas
Cp,gas (J/mol*K) | Temperature (K) | Reference | Comment |
---|---|---|---|
37.95 | 50. | Dorofeeva O.V., 1989 | These statistically calculated values were obtained using force field approximation for polycyclic aromatic hydrocarbons to estimate the needed vibrational frequencies (see also [ Dorofeeva O.V., 1986, Moiseeva N.F., 1990]). These functions are reproduced in the reference book [ Frenkel M., 1994]. |
57.15 | 100. | ||
85.00 | 150. | ||
118.22 | 200. | ||
171.26 | 273.15 | ||
189.5 ± 2.0 | 298.15 | ||
190.84 | 300. | ||
259.00 | 400. | ||
315.67 | 500. | ||
360.84 | 600. | ||
396.84 | 700. | ||
425.91 | 800. | ||
449.73 | 900. | ||
469.48 | 1000. | ||
486.02 | 1100. | ||
499.98 | 1200. | ||
511.83 | 1300. | ||
521.95 | 1400. | ||
530.64 | 1500. |

Phase change data

Data compiled by: William E. Acree, Jr., James S. Chickos
Quantity | Value | Units | Method | Reference | Comment |
---|---|---|---|---|---|
ΔvapH° | 83.4 ± 0.7 | kJ/mol | CGC | Hanshaw, Nutt, et al., 2008 |

Lee's RI, non-polar column, temperature ramp

Data compiled by: NIST Mass Spectrometry Data Center, William E. Wallace, director

Column type CapillaryCapillaryCapillaryCapillaryCapillary
Active phase HP-5HP-55 % Phenyl methyl siloxane5 % Phenyl methyl siloxaneHP-5
Column length (m) 30.30.  30.
Carrier gas HeliumHe  Helium
Substrate
Column diameter (mm) 0.300.3  0.25
Phase thickness (μm) 0.250.25  0.25
Tstart (C) 50.50.50.80.50.
Tend (C) 200.200.250.300.310.
Heat rate (K/min) 5.5.2.8.6.
Initial hold (min) 5.5. 2.1.5
Final hold (min) 15.15. 10.10.
I 318.6318.6322.08322.30322.64
ReferenceWang, Hou, et al., 2007Shao, Wang, et al., 2006Skrbic and Onjia, 2006Skrbic and Onjia, 2006Pedersen, Durant, et al., 2005
Comment MSDC-RI MSDC-RI MSDC-RI MSDC-RI MSDC-RI
Column type CapillaryCapillaryCapillaryCapillaryCapillary
Active phase HP-5DB-5MSDB-5MSHP-5SPB-5
Column length (m) 60.30.30.30.30.
Carrier gas He
Substrate
Column diameter (mm) 0.250.250.250.250.25
Phase thickness (μm) 0.250.50.50.25
Tstart (C) 35.40.40.50.40.
Tend (C) 300.310.310.280.300.
Heat rate (K/min) 3.10.4.4.4.
Initial hold (min)  1.1.2.2.
Final hold (min)    20.
I 321.96322.52322.42322.02322.5
ReferenceMarynowski, Pieta, et al., 2004Chen, Keeran, et al., 2002Chen, Keeran, et al., 2002Piao, Chu, et al., 1999Knobloch and Engewald, 1993
Comment MSDC-RI MSDC-RI MSDC-RI MSDC-RI MSDC-RI
Column type CapillaryCapillaryCapillaryCapillary
Active phase DB-5DB-5SE-52SE-52
Column length (m) 30.30.20.12.
Carrier gas  HeH2He
Substrate
Column diameter (mm) 0.250.250.300.3
Phase thickness (μm) 0.25 0.250.34
Tstart (C) 40.90.40.50.
Tend (C) 280.325.265.250.
Heat rate (K/min) 4.4.4.2.
Initial hold (min) 2. 2.
Final hold (min) 5.
I 321.96322.15321.77322.08
ReferenceWise, Benner, et al., 1988Tong, Centen, et al., 1985Vassilaros, Kong, et al., 1982Lee, Vassilaros, et al., 1979
Comment MSDC-RI MSDC-RI MSDC-RI MSDC-RI

Van Den Dool and Kratz RI, non-polar column, custom temperature program

Data compiled by: NIST Mass Spectrometry Data Center, William E. Wallace, director

Column type Capillary
Active phase Methyl Silicone
Column length (m)
Carrier gas
Substrate
Column diameter (mm)
Phase thickness (μm)
Program 50C (2min) => 20C/min => 160C => 5C/min => 210C => 10C/min => 300C
I 1879.
ReferenceOda, Ichikawa, et al., 1996
Comment MSDC-RI

Van Den Dool and Kratz RI, non-polar column, temperature ramp

Data compiled by: NIST Mass Spectrometry Data Center, William E. Wallace, director

Column type CapillaryCapillaryCapillary
Active phase SE-52SE-52SE-52
Column length (m) 12.12.65.
Carrier gas HeHeN2
Substrate
Column diameter (mm) 0.30.280.3
Phase thickness (μm) 0.340.17
Tstart (C) 50.50.100.
Tend (C) 250.250.300.
Heat rate (K/min) 2.2.1.8
Initial hold (min)
Final hold (min)
I 1876.181864.281875.
ReferenceLee, Vassilaros, et al., 1979Lee, Vassilaros, et al., 1979Carugno and Rossi, 1967
Comment MSDC-RI MSDC-RI MSDC-RI

References

Dorofeeva O.V., 1989
Dorofeeva O.V.,
Thermodynamic Properties of Gaseous Polycyclic Aromatic Hydrocarbons Containing Five-Membered Rings. Institute for High Temperatures, USSR Academy of Sciences, Preprint No.1-263 (in Russian), Moscow, 1989. [all data]
Dorofeeva O.V., 1986
Dorofeeva O.V.,
On calculation of thermodynamic properties of polycyclic aromatic hydrocarbons,
Thermochim. Acta, 1986, 102, 59-66. [all data]
Moiseeva N.F., 1990
Moiseeva N.F.,
Group additivity scheme for calculating the chemical thermodynamic properties of gaseous polycyclic aromatic hydrocarbons containing five-membered rings,
Thermochim. Acta, 1990, 168, 179-186. [all data]
Frenkel M., 1994
Frenkel M.,
Thermodynamics of Organic Compounds in the Gas State, Vol. I, II, Thermodynamics Research Center, College Station, Texas, 1994, 1994. [all data]
Hanshaw, Nutt, et al., 2008
Hanshaw, William; Nutt, Marjorie; Chickos, James S.,
Hypothetical Thermodynamic Properties. Subcooled Vaporization Enthalpies and Vapor Pressures of Polyaromatic Hydrocarbons,
J. Chem. Eng. Data, 2008, 53, 8, 1903-1913, https://doi.org/10.1021/je800300x
. [all data]