β-Ethylphenethyl alcohol
- Formula: C10H14O
- Molecular weight: 150.2176
- IUPAC Standard InChIKey: DNHNBMQCHKKDNI-UHFFFAOYSA-N
- CAS Registry Number: 2035-94-1
- Chemical structure:
View 3d structure (requires JavaScript / HTML 5) - Other names: Benzeneethanol, β-ethyl-; 1-Butanol, 2-phenyl; 2-phenylbutane-1-ol

Phase change data

Data compiled by: Robert L. Brown and Stephen E. Stein
Quantity | Value | Units | Method | Reference | Comment |
---|---|---|---|---|---|
Tboil | 508.2 | K | N/A | Aldrich Chemical Company Inc., 1990 |

Normal alkane RI, non-polar column, custom temperature program

Column type | Active phase | I | Reference | Comment |
---|---|---|---|---|
Capillary | HP-5 | 1261. | Splivallo, Bossi, et al., 2007 | He; Program: 50C => 3C/min => 200C(10min) => 10C/min => 290C(10min) |
Capillary | SE-30 | 1262. | Vinogradov, 2004 | Program: not specified |
Capillary | Polydimethyl siloxanes | 1262. | Zenkevich, 1997 | Program: not specified |

Normal alkane RI, polar column, custom temperature program

Column type | Active phase | I | Reference | Comment |
---|---|---|---|---|
Capillary | Carbowax 20M | 1950. | Vinogradov, 2004 | Program: not specified |

References

Aldrich Chemical Company Inc., 1990
Aldrich Chemical Company Inc.,
Catalog Handbook of Fine Chemicals, Aldrich Chemical Company, Inc., Milwaukee WI, 1990, 1. [all data]
Splivallo, Bossi, et al., 2007
Splivallo, R.; Bossi, S.; Maffei, M.; Bonfante, P.,
Discrimination of truffle fruiting body versus mycelial aromas by stir bar sorptive extraction,
Phytochemistry, 2007, 68, 20, 2584-2598, https://doi.org/10.1016/j.phytochem.2007.03.030
. [all data]
Vinogradov, 2004
Vinogradov, B.A.,
Production, composition, properties and application of essential oils, 2004, retrieved from http://viness.narod.ru. [all data]
Zenkevich, 1997
Zenkevich, I.G.,
Analytical Parameters of Components of Essential Oils for their Chromatographic and Chromato-Spectral Identificaiton. Oxsigenated derivatives of Mono- and Sesquiterpene Hydrocarbons,
Rastit, Resursy (Rus.), 1997, 33, 1, 16-28. [all data]