Cyclohexane, 1,3-dimethyl-2-methylene-, trans-
- Formula: C9H16
- Molecular weight: 124.2233
- IUPAC Standard InChIKey: UTQSTOKTRPNZHE-YUMQZZPRSA-N
- CAS Registry Number: 20348-74-7
- Chemical structure:
View 3d structure (requires JavaScript / HTML 5) - Stereoisomers:
- Other names: trans-1,3-Dimethyl-2-methylenecyclohexane

Phase change data

Data compiled by: Thermodynamics Research Center, NIST Boulder Laboratories, Chris Muzny director
Quantity | Value | Units | Method | Reference | Comment |
---|---|---|---|---|---|
Tboil | 390.77 | K | N/A | Streiff, 1964 | Uncertainty assigned by TRC = 0.15 K |
Quantity | Value | Units | Method | Reference | Comment |
Tfus | 215.310 | K | N/A | Streiff, 1964 | Crystal phase 1 phase; Uncertainty assigned by TRC = 0.05 K |
Tfus | 215.370 | K | N/A | Streiff, 1964 | Crystal phase 1 phase; Uncertainty assigned by TRC = 0.02 K |

References

Streiff, 1964
Streiff, A.J.,
, Am. Pet. Inst. Res. Proj. 58B Unpublished, 1964. [all data]