Methiocarb
- Formula: C11H15NO2S
- Molecular weight: 225.307
- IUPAC Standard InChIKey: YFBPRJGDJKVWAH-UHFFFAOYSA-N
- CAS Registry Number: 2032-65-7
- Chemical structure:
View 3d structure (requires JavaScript / HTML 5) - Other names: Phenol, 3,5-dimethyl-4-(methylthio)-, methylcarbamate; Carbamic acid, methyl-, 4-(methylthio)-3,5-xylyl ester; B 37344; BAY 37344; BAY 5024; DCR 736; Mercaptodimethur; Mesurol; Mesurol phenol; Metmercapturan; Metmercapturon; SD 9228; 3,5-Dimethyl-4-(Methylthio)phenyl methylcarbamate; 4-(Methylthio)-3,5-dimethylphenyl methylcarbamate; 4-(Methylthio)-3,5-xylyl methylcarbamate; Carbamic acid, N-methyl-, 4-(methylthio)-3,5-xylyl ester; BAY 9026; BAYER 37344; Carbamic acid, methyl-, 3,5-dimethyl-4-(methylthio)phenyl ester; 3,5-Dimethyl-4-(methylthio)phenol methylcarbamate; 3,5-Dimethyl-4-methyl-thiophenyl-N-carbamat; 3,5-Dimethyl-4-methylthiophenyl N-methylcarbamate; Draza; ENT 25,726; H 321; Methiocarbe; Methyl carbamic acid 4-(methylthio)-3,5-xylyl ester; 4-Methylmercapto-3,5-dimethylphenyl N-methylcarbamate; 4-Methylmercapto-3,5-xylyl methylcarbamate; OMS-93; 3,5-Xylenol, 4-(methylthio)-, methylcarbamate; Club; Phenyl-3,5-dimethyl-4-(methylthio)-, methylcarbamate; Carbamic acid, 3,5-dimethyl-4-methylthiophenyl ester, N-methyl

Phase change data

Data compiled as indicated in comments:
TRC - Thermodynamics Research Center, NIST Boulder Laboratories, Chris Muzny director
AC - William E. Acree, Jr., James S. Chickos
Quantity | Value | Units | Method | Reference | Comment |
---|---|---|---|---|---|
Tfus | 394.44 | K | N/A | Donnelly, Drewes, et al., 1990 | Uncertainty assigned by TRC = 0.2 K; TRC |
Tfus | 394.8 | K | N/A | Plato, 1972 | Uncertainty assigned by TRC = 0.2 K; TRC |
Enthalpy of fusion
ΔfusH (kcal/mol) | Temperature (K) | Method | Reference | Comment |
---|---|---|---|---|
7.256 | 393.8 | DSC | Acree, 1991 | See also Donnelly, Drewes, et al., 1990, 2.; AC |

Kovats' RI, non-polar column, temperature ramp

View large format table.

Column type Active phase I Reference Comment
CapillaryDB-11915.Hall, Whitehead, et al., 1986He, 6. K/min; Column length: 15. m; Column diameter: 0.25 mm; Tstart: 100. C; Tend: 270. C
CapillaryDB-51956.Hall, Whitehead, et al., 1986He, 6. K/min; Column length: 15. m; Column diameter: 0.25 mm; Tstart: 100. C; Tend: 270. C

References

Donnelly, Drewes, et al., 1990
Donnelly, J.R.; Drewes, L.A.; Johnson, R.L.; Munslow, W.D.; Knapp, K.K.; Sovocool, G.W.,
Purity and heat of fusion data for environmental standards as determined by differential scanning calorimetry,
Thermochim. Acta, 1990, 167, 2, 155, https://doi.org/10.1016/0040-6031(90)80476-F
. [all data]
Plato, 1972
Plato, C.,
DSC as a general method for determining purity and heat of fusion of high-purity organic chemicals,
Anal. Chem., 1972, 44, 1531. [all data]
Acree, 1991
Acree, William E.,
Thermodynamic properties of organic compounds: enthalpy of fusion and melting point temperature compilation,
Thermochimica Acta, 1991, 189, 1, 37-56, https://doi.org/10.1016/0040-6031(91)87098-H
. [all data]
Donnelly, Drewes, et al., 1990, 2
Donnelly, J.R.; Drewes, L.A.; Johnson, R.L.; Munslow, W.D.; Knapp, K.K.; Sovocool, G.W.,
Purity and heat of fusion data for environmental standards as determined by differential scanning calorimetry,
Thermochimica Acta, 1990, 167, 2, 155-187, https://doi.org/10.1016/0040-6031(90)80476-F
. [all data]