Aminocarb
- Formula: C11H16N2O2
- Molecular weight: 208.2569
- IUPAC Standard InChIKey: IMIDOCRTMDIQIJ-UHFFFAOYSA-N
- CAS Registry Number: 2032-59-9
- Chemical structure:
View 3d structure (requires JavaScript / HTML 5) - Other names: Phenol, 4-(dimethylamino)-3-methyl-, methylcarbamate (ester); Carbamic acid, methyl-, 4-(dimethylamino)-m-tolyl ester; BAY 44646; Matacil; Mitacil; 3-Methyl-4-(Dimethylamino)phenyl methylcarbamate; 4-(Dimethylamino)-m-tolyl methylcarbamate; 4-(Dimethylamino)-3-cresyl methylcarbamate; 4-(Dimethylamino)-3-tolyl methylcarbamate; Phenol, 4-(dimethylamino)-3-methyl-, methylcarbamate; 4-Dimethylamino-3-methylphenyl methylcarbamate; A 363; Aminocarbe; Bayer 5080; BAYER 44646; Carbamic acid, methyl-, 4-(dimethylamino)-3-methylphenyl ester; m-Cresol, 4-(dimethylamino)-, methylcarbamate; 4-Dimethylamino- m-cresyl methylcarbamate; 4-(Dimethylamino)-3-methylphenol methyl carbamate; (4-Dimethylamino-3-methyl-phenyl)N-methyl-carbamaat; (4-Dimethylamino-3-methyl-phenyl)N-methyl-carbamat; (4-Dimethylamino-3-methyl-phenyl)N-methyl-carbamate; (4-Dimetilamino-3-metil-fenil)-N-metil-carbammato; ENT 25,784; N-Methylcarbamate de 4-dimethylamino 3-methyl phenyle; Matacil 180D

Phase change data

Data compiled by: Thermodynamics Research Center, NIST Boulder Laboratories, Chris Muzny director
Quantity | Value | Units | Method | Reference | Comment |
---|---|---|---|---|---|
Tfus | 368. | K | N/A | Plato, 1972 | Uncertainty assigned by TRC = 0.2 K |

Kovats' RI, non-polar column, temperature ramp

Column type | Active phase | I | Reference | Comment |
---|---|---|---|---|
Capillary | DB-1 | 1743. | Hall, Whitehead, et al., 1986 | He, 6. K/min; Column length: 15. m; Column diameter: 0.25 mm; Tstart: 100. C; Tend: 270. C |
Capillary | DB-5 | 1781. | Hall, Whitehead, et al., 1986 | He, 6. K/min; Column length: 15. m; Column diameter: 0.25 mm; Tstart: 100. C; Tend: 270. C |

References

Plato, 1972
Plato, C.,
DSC as a general method for determining purity and heat of fusion of high-purity organic chemicals,
Anal. Chem., 1972, 44, 1531. [all data]
Hall, Whitehead, et al., 1986
Hall, G.L.; Whitehead, W.E.; Mourer, C.R.; Shibamoto, T.,
A new gas chromatographic retention index for pesticides and related compounds,
J. Hi. Res. Chromatogr. Chromatogr. Comm., 1986, 9, 5, 266-271, https://doi.org/10.1002/jhrc.1240090503
. [all data]