di-n-Amylfumarate
- Formula: C14H24O4
- Molecular weight: 256.3380
- IUPAC Standard InChIKey: NFCMRHDORQSGIS-MDZDMXLPSA-N
- CAS Registry Number: 20314-74-3
- Chemical structure:
View 3d structure (requires JavaScript / HTML 5) - Stereoisomers:
- Other names: Dipentyl fumarate

Phase change data

Data compiled by: Robert L. Brown and Stephen E. Stein
Reduced pressure boiling point
Tboil (K) | Pressure (bar) | Reference |
---|---|---|
464. to 466. | 0.033 | Frinton Laboratories Inc., 1986 |

Normal alkane RI, non-polar column, custom temperature program

Column type | Active phase | I | Reference | Comment |
---|---|---|---|---|
Capillary | SE-30 | 1558. | Vinogradov, 2004 | Program: not specified |

References

Frinton Laboratories Inc., 1986
Frinton Laboratories Inc.,
Catalog Number 11, Frinton Laboratories Inc., Vineland, NJ, 1986, 99. [all data]
Vinogradov, 2004
Vinogradov, B.A.,
Production, composition, properties and application of essential oils, 2004, retrieved from http://viness.narod.ru. [all data]