Benzo[ghi]fluoranthene
- Formula: C18H10
- Molecular weight: 226.2720
- IUPAC Standard InChIKey: YEIHPPOCKIHUQJ-UHFFFAOYSA-N
- CAS Registry Number: 203-12-3
- Chemical structure:
View 3d structure (requires JavaScript / HTML 5) - Other names: Benzo[mno]fluoranthene; Benzofluoranthene; 1,10-Benzofluoranthrene; 1,12-Benzfluoranthene; Benz-(m,n,o)-fluoranthene

Gas phase thermochemistry data

Data compiled by: Glushko Thermocenter, Russian Academy of Sciences, Moscow
Constant pressure heat capacity of gas
Cp,gas (J/mol*K) | Temperature (K) | Reference | Comment |
---|---|---|---|
39.55 | 50. | Dorofeeva O.V., 1989 | These statistically calculated values were obtained using force field approximation for polycyclic aromatic hydrocarbons to estimate the needed vibrational frequencies (see also [ Dorofeeva O.V., 1986, Moiseeva N.F., 1990]). The S(300 K) and Cp(300 K) values calculated by MM3 method [ Pope C.J., 1995] are 25.5 and 8.8 J/mol*K, respectively, greater than selected ones. Recommended values are also reproduced in the reference book [ Frenkel M., 1994]. |
63.36 | 100. | ||
96.85 | 150. | ||
135.78 | 200. | ||
196.42 | 273.15 | ||
217.0 ± 2.5 | 298.15 | ||
218.55 | 300. | ||
295.28 | 400. | ||
359.08 | 500. | ||
409.98 | 600. | ||
450.48 | 700. | ||
483.06 | 800. | ||
509.64 | 900. | ||
531.58 | 1000. | ||
549.88 | 1100. | ||
565.26 | 1200. | ||
578.28 | 1300. | ||
589.38 | 1400. | ||
598.89 | 1500. |

Phase change data

Data compiled as indicated in comments:
TRC - Thermodynamics Research Center, NIST Boulder Laboratories, Chris Muzny director
AC - William E. Acree, Jr., James S. Chickos
CAL - James S. Chickos, William E. Acree, Jr., Joel F. Liebman, Students of Chem 202 (Introduction to the Literature of Chemistry), University of Missouri -- St. Louis
Quantity | Value | Units | Method | Reference | Comment |
---|---|---|---|---|---|
Tfus | 424.4 | K | N/A | Smith, 1980 | Crystal phase 1 phase; Uncertainty assigned by TRC = 0.4 K; TRC |
Enthalpy of fusion
ΔfusH (kJ/mol) | Temperature (K) | Reference | Comment |
---|---|---|---|
11.8 | 424. | Smith, 1980, 2 | AC |
Entropy of fusion
ΔfusS (J/mol*K) | Temperature (K) | Reference | Comment |
---|---|---|---|
13.28 | 402.8 | Smith, 1979 | CAL |
2.19 | 402.1 | ||
1.23 | 352.7 | ||
27.83 | 424. |

Kovats' RI, non-polar column, isothermal

View large format table.

Column type Active phase Temperature (C) I Reference Comment
CapillaryOV-101270.2438.Grimmer and Böhnke, 1972N2; Column length: 50. m; Column diameter: 0.50 mm

Van Den Dool and Kratz RI, non-polar column, temperature ramp

View large format table.

Column type Active phase I Reference Comment
CapillaryOV-12431.5Zhang, Shen, et al., 200025. m/0.2 mm/0.33 μm, 5. K/min; Tstart: 100. C; Tend: 180. C
CapillaryOV-12410.8Zhang, Shen, et al., 200025. m/0.2 mm/0.33 μm, 5. K/min; Tstart: 100. C; Tend: 180. C

Lee's RI, non-polar column, isothermal

View large format table.

Column type Active phase Temperature (C) I Reference Comment
PackedMethyl Silicone200.390.43Shlyakhov, 1984
PackedMethyl Silicone240.390.50Shlyakhov, 1984
PackedMethyl Silicone260.391.95Shlyakhov, 1984
PackedMethyl Silicone300.393.40Shlyakhov, 1984

Lee's RI, non-polar column, temperature ramp

View large format table.

Column type Active phase I Reference Comment
CapillaryPE-5390.Jamoussi, Kanzari, et al., 200720. m/0.18 mm/0.18 μm, 50. C @ 1.5 min, 8. K/min; Tend: 345. C
Capillary5 % Phenyl methyl siloxane389.60Skrbic and Onjia, 20062. K/min; Tstart: 50. C; Tend: 250. C
Capillary5 % Phenyl methyl siloxane390.90Skrbic and Onjia, 200680. C @ 2. min, 8. K/min, 300. C @ 10. min
CapillaryHP-5391.02Pedersen, Durant, et al., 200530. m/0.25 mm/0.25 μm, Helium, 50. C @ 1.5 min, 6. K/min, 310. C @ 10. min
CapillaryHP-5390.28Marynowski, Pieta, et al., 200460. m/0.25 mm/0.25 μm, He, 3. K/min; Tstart: 35. C; Tend: 300. C
CapillaryDB-5MS390.83Chen, Keeran, et al., 200230. m/0.25 mm/0.5 μm, 40. C @ 1. min, 10. K/min; Tend: 310. C
CapillaryDB-5MS390.85Chen, Keeran, et al., 200230. m/0.25 mm/0.5 μm, 40. C @ 1. min, 4. K/min; Tend: 310. C
CapillaryHP-5390.61Piao, Chu, et al., 199930. m/0.25 mm/0.25 μm, 50. C @ 2. min, 4. K/min, 280. C @ 20. min
CapillarySPB-5390.9Knobloch and Engewald, 199340. C @ 2. min, 4. K/min; Column length: 30. m; Column diameter: 0.25 mm; Tend: 300. C
CapillaryDB-5390.28Wise, Benner, et al., 198830. m/0.25 mm/0.25 μm, 40. C @ 2. min, 4. K/min, 280. C @ 5. min
CapillaryDB-5390.63Tong, Centen, et al., 1985He, 4. K/min; Column length: 30. m; Column diameter: 0.25 mm; Tstart: 90. C; Tend: 325. C
CapillaryDB-5391.059Tong, Shore, et al., 1984He, 80. C @ 1. min, 3. K/min, 300. C @ 10. min; Column length: 30. m; Column diameter: 0.32 mm
CapillarySE-52389.92Vassilaros, Kong, et al., 198220. m/0.30 mm/0.25 μm, H2, 40. C @ 2. min, 4. K/min; Tend: 265. C
CapillarySE-52389.60Lee, Vassilaros, et al., 197912. m/0.3 mm/0.34 μm, He, 2. K/min; Tstart: 50. C; Tend: 250. C

Lee's RI, non-polar column, custom temperature program

View large format table.

Column type Active phase I Reference Comment
CapillaryHP-5MS390.18Wang, Li, et al., 200730. m/0.25 mm/0.25 μm, He; Program: 60C(2min) => 6C/min => 258C => 2C/min => 300C(4min)
CapillaryHP-5MS389.92Wang, Li, et al., 2007, 230. m/0.25 mm/0.25 μm, He; Program: not specified
CapillaryHP-5MS390.18Wang, Li, et al., 2007, 230. m/0.25 mm/0.25 μm, He; Program: not specified
CapillaryHP-5MS390.28Wang, Li, et al., 2007, 230. m/0.25 mm/0.25 μm, He; Program: not specified
Capillary5 % Phenyl methyl siloxane389.60Skrbic and Onjia, 2006Program: 70 0C (2 min) 30 0C/min -> 150 0C 5 0C/min -> 200 0C 4 0C/min -> 310 0C (5 min)
CapillaryDB-5MS388.2Aracil, Font, et al., 2005Column length: 60. m; Column diameter: 0.25 mm; Program: not specified
CapillaryLM-5389.69Ré-Poppi and Santiago-Silva, 200530. m/0.25 mm/0.25 μm, He; Program: 60C(2min) => 15C/min => 180C => 5C/min => 280C (10min)
CapillaryUltra-1389.6Sremac, Skrbic, et al., 200550. m/0.32 mm/0.50 μm, Nitrogen; Program: 40-100 0C 3-15 0C/min -> 290 0C
CapillaryUltra-1389.6Sremac, Skrbic, et al., 200550. m/0.32 mm/0.50 μm, Nitrogen; Program: 40-100 0C 3-15 0C/min -> 290 0C
CapillaryUltra-1390.9Sremac, Skrbic, et al., 200550. m/0.32 mm/0.50 μm, Nitrogen; Program: 40-100 0C 3-15 0C/min -> 290 0C
CapillaryHP-5 MS391.1Brack and Schirmer, 200330. m/0.25 mm/0.25 μm, Helium; Program: 70 0C 7 0C/min -> 280 0C (2 min) 7 0C/min -> 300 0C (2 min)
CapillaryDB-5390.9Lundstedt, Haglund, et al., 200330. m/0.25 mm/0.25 μm; Program: not specified
CapillaryLM-5389.67Ré-Poppi and Santiago-Silva, 200230. m/0.25 mm/0.25 μm, He; Program: 60C(2min) => 15C/min => 180C => 5C/min => 280C(5min)
CapillaryDB-5390.96Zamperlini, Silva, et al., 199730. m/0.25 mm/0.25 μm, He; Program: 90C (1min) => 10C/min => 120C => 4C/min => 310C (20min)
CapillarySE-54388.58Guillen, Iglesias, et al., 1992Program: not specified
CapillaryDB-5389.64Takada, Onda, et al., 1990He; Program: 70C(2min) => 30C/min => 150C => 5C/min => 200C => 4C/min => 310C
CapillaryDB-5389.60Naikwadi, Charbonneau, et al., 1987Column length: 30. m; Column diameter: 0.32 mm; Program: not specified
CapillaryDB-5389.60Naikwadi, Charbonneau, et al., 1987Column length: 30. m; Column diameter: 0.32 mm; Program: not specified
CapillaryDB-5391.21Naikwadi, Charbonneau, et al., 1987Column length: 30. m; Column diameter: 0.32 mm; Program: not specified
CapillaryDB-5391.41Naikwadi, Charbonneau, et al., 1987Column length: 30. m; Column diameter: 0.32 mm; Program: not specified
CapillaryOV-101391.6Tucminen, Wickstrom, et al., 1986Program: not specified
CapillaryDB-5389.60Tong, Centen, et al., 1985He; Column length: 30. m; Column diameter: 0.25 mm; Program: not specified
CapillarySE-52385.75Shlyakhov, 1984Program: not specified
CapillarySE-52389.11Shlyakhov, 1984Program: not specified
CapillarySE-52389.60Shlyakhov, 1984Program: not specified
CapillarySE-52389.97Shlyakhov, 1984Program: not specified
CapillarySE-52391.00Shlyakhov, 1984Program: not specified

References

Dorofeeva O.V., 1989
Dorofeeva O.V.,
Thermodynamic Properties of Gaseous Polycyclic Aromatic Hydrocarbons Containing Five-Membered Rings. Institute for High Temperatures, USSR Academy of Sciences, Preprint No.1-263 (in Russian), Moscow, 1989. [all data]
Dorofeeva O.V., 1986
Dorofeeva O.V.,
On calculation of thermodynamic properties of polycyclic aromatic hydrocarbons,
Thermochim. Acta, 1986, 102, 59-66. [all data]
Moiseeva N.F., 1990
Moiseeva N.F.,
Group additivity scheme for calculating the chemical thermodynamic properties of gaseous polycyclic aromatic hydrocarbons containing five-membered rings,
Thermochim. Acta, 1990, 168, 179-186. [all data]
Pope C.J., 1995
Pope C.J.,
Thermochemical properties of curved PAH and fullerenes: a group additivity method compared with MM3(92) and MOPAC predictions,
J. Phys. Chem., 1995, 99, 4306-4316. [all data]
Frenkel M., 1994
Frenkel M.,
Thermodynamics of Organic Compounds in the Gas State, Vol. I, II, Thermodynamics Research Center, College Station, Texas, 1994, 1994. [all data]
Smith, 1980
Smith, G.W.,
Phase behavior of some condensed polycyclic aromatics,
Mol. Cryst. Liq. Cryst., 1980, 64, 15. [all data]
Smith, 1980, 2
Smith, George W.,
Phase Behavior of some Condensed Polycyclic Aromatics,
Molecular Crystals and Liquid Crystals, 1980, 64, 1, 15-17, https://doi.org/10.1080/01406568008072649
. [all data]
Smith, 1979
Smith, G.W.,
Mol. Cryst. Liq. Cryst., 1979, 15. [all data]