Cyclopentane, 1,1,3,4-tetramethyl-, trans-
- Formula: C9H18
- Molecular weight: 126.2392
- IUPAC Standard InChIKey: OWHFMVURUNNXMJ-HTQZYQBOSA-N
- CAS Registry Number: 20309-77-7
- Chemical structure:
View 3d structure (requires JavaScript / HTML 5) - Stereoisomers:
- Other names: trans-1,1,3,4-Tetramethylcyclopentane

Phase change data

Data compiled by: Thermodynamics Research Center, NIST Boulder Laboratories, Chris Muzny director
Quantity | Value | Units | Method | Reference | Comment |
---|---|---|---|---|---|
Tboil | 394.76 | K | N/A | Anonymous, 1961 | Uncertainty assigned by TRC = 0.1 K |
Tboil | 394.8 | K | N/A | Glasgow, Gordon, et al., 1957 | Uncertainty assigned by TRC = 0.3 K |
Quantity | Value | Units | Method | Reference | Comment |
Tfus | 180.060 | K | N/A | Anonymous, 1961 | Uncertainty assigned by TRC = 0.03 K |
Tfus | 180.060 | K | N/A | Anonymous, 1961 | Metastable crystal phase; Uncertainty assigned by TRC = 0.04 K; from temp-time cooling curve. |
Tfus | 180.46 | K | N/A | Anonymous, 1961 | Uncertainty assigned by TRC = 0.06 K; All data from temp-time cooling curve. Phase C was observed only in one experiment |
Tfus | 179.21 | K | N/A | Anonymous, 1951 | Uncertainty assigned by TRC = 0.3 K |

Kovats' RI, non-polar column, isothermal

Column type | Active phase | Temperature (C) | I | Reference | Comment |
---|---|---|---|---|---|
Capillary | Vacuum Grease Oil (VM-4) | 35. | 772. | Sidorov, Petrova, et al., 1972 | |
Capillary | Vacuum Grease Oil (VM-4) | 45. | 775. | Sidorov, Petrova, et al., 1972 | |
Capillary | Vacuum Grease Oil (VM-4) | 50. | 776. | Sidorov, Petrova, et al., 1972 | |
Capillary | Vacuum Grease Oil (VM-4) | 58. | 778. | Sidorov, Petrova, et al., 1972 | |
Capillary | Vacuum Grease Oil (VM-4) | 68. | 779. | Sidorov, Petrova, et al., 1972 | |
Packed | Vacuum Grease Oil (VM-4) | 35. | 772. | Sidorov, Ivanova, et al., 1971 |

Kovats' RI, non-polar column, temperature ramp

Column type | Active phase | I | Reference | Comment |
---|---|---|---|---|
Capillary | Apiezon L | 778. | Louis, 1971 | N2, 1. K/min; Column length: 50. m; Column diameter: 0.25 mm; Tstart: 60. C |

References

Anonymous, 1961
Anonymous, R.,
Preliminary thermodyn. prop. of FREON-14, E. I. Du Pont, Freon Tech. Bull. T-14, 1961. [all data]
Glasgow, Gordon, et al., 1957
Glasgow, A.R.; Gordon, R.J.; Willingham, C.B.; Mair, B.J.; Rossini, F.D.,
Hydrocarbons in the 116 deg C to 126 deg C Fraction of Petroleum,
Anal. Chem., 1957, 29, 357. [all data]
Anonymous, 1951
Anonymous, R.,
, Sunbury Rep. No. 4199, Anglo-Iranian Oil Co., 1951. [all data]