DL-2-hexanol
- Formula: C6H14O
- Molecular weight: 102.1748
- IUPAC Standard InChIKey: QNVRIHYSUZMSGM-UHFFFAOYSA-N
- CAS Registry Number: 20281-86-1
- Chemical structure:
View 3d structure (requires JavaScript / HTML 5) - Species with the same structure:
- Stereoisomers:

Phase change data

Data compiled by: Thermodynamics Research Center, NIST Boulder Laboratories, Chris Muzny director
Quantity | Value | Units | Method | Reference | Comment |
---|---|---|---|---|---|
Tboil | 411.65 | K | N/A | Levene and Haller, 1928 | Uncertainty assigned by TRC = 3. K |

References

Levene and Haller, 1928
Levene, P.A.; Haller, H.L.,
J. Biol. Chem., 1928, 79, 475. [all data]