1-Butanol, 2,3-dimethyl-,
- Formula: C6H14O
- Molecular weight: 102.1748
- IUPAC Standard InChIKey: SXSWMAUXEHKFGX-UHFFFAOYSA-N
- CAS Registry Number: 20281-85-0
- Chemical structure:
View 3d structure (requires JavaScript / HTML 5) - Species with the same structure:
- Stereoisomers:

Phase change data

Data compiled by: Robert L. Brown and Stephen E. Stein
Quantity | Value | Units | Method | Reference | Comment |
---|---|---|---|---|---|
Tboil | 417.7 | K | N/A | Weast and Grasselli, 1989 |

References

Weast and Grasselli, 1989
CRC Handbook of Data on Organic Compounds, 2nd Editon, Weast,R.C and Grasselli, J.G., ed(s)., CRC Press, Inc., Boca Raton, FL, 1989, 1. [all data]