9-Octadecenoic acid
- Formula: C18H34O2
- Molecular weight: 282.4614
- IUPAC Standard InChIKey: ZQPPMHVWECSIRJ-MDZDMXLPSA-N
- CAS Registry Number: 2027-47-6
- Chemical structure:
View 3d structure (requires JavaScript / HTML 5) - Species with the same structure:
- Stereoisomers:
- Other names: Elaidic acid; Oleic acid

Condensed phase thermochemistry data

Data compiled by: Hussein Y. Afeefy, Joel F. Liebman, and Stephen E. Stein
Quantity | Value | Units | Method | Reference | Comment |
---|---|---|---|---|---|
ΔcH°liquid | -11127.1 | kJ/mol | Ccb | Keffler and McLean, 1935 | Corresponding ΔfHºliquid = -815.21 kJ/mol (simple calculation by NIST; no Washburn corrections) |
ΔcH°liquid | -11128. | kJ/mol | Ccb | Emery and Benedict, 1911 | Corresponding ΔfHºliquid = -814. kJ/mol (simple calculation by NIST; no Washburn corrections) |

Normal alkane RI, non-polar column, temperature ramp

View large format table.

Column type Active phase I Reference Comment
CapillaryHP-5 MS2141.Radulovic, Blagojevic, et al., 200930. m/0.25 mm/0.25 μm, Helium, 5. K/min, 290. C @ 10. min; Tstart: 70. C
CapillaryHP-52143.9Leffingwell and Alford, 200560. m/0.32 mm/0.25 μm, He, 30. C @ 2. min, 2. K/min, 260. C @ 28. min

Normal alkane RI, non-polar column, custom temperature program

View large format table.

Column type Active phase I Reference Comment
CapillaryHP-52123.Ansorena, Astiasarán, et al., 200030. m/0.25 mm/0.25 μm, He; Program: 40C (10min) => 3C/min => 120C => 10C/min => 250C (5min)

References

Keffler and McLean, 1935
Keffler, L.; McLean, J.H.,
Homology in long-chain compounds, I. Oleic acid and the n-alkul oleates,
J. Soc. Chem. Ind., 1935, 178-185. [all data]
Emery and Benedict, 1911
Emery, A.G.; Benedict, F.G.,
The heat of combustion of compounds of physiological importance,
Am. J. Physiol., 1911, 28, 301-307. [all data]