Naphthalene, 2-propyl-
- Formula: C13H14
- Molecular weight: 170.2503
- IUPAC Standard InChIKey: LQBNOHAXLHRIQW-UHFFFAOYSA-N
- CAS Registry Number: 2027-19-2
- Chemical structure:
View 3d structure (requires JavaScript / HTML 5) - Other names: 2-Propylnaphthalene

Phase change data

Data compiled by: Thermodynamics Research Center, NIST Boulder Laboratories, Chris Muzny director
Quantity | Value | Units | Method | Reference | Comment |
---|---|---|---|---|---|
Tboil | 548. ± 6. | K | AVG | N/A | Average of 8 values; Individual data points |
Quantity | Value | Units | Method | Reference | Comment |
Tfus | 269.5 | K | N/A | Luther, 1955 | Uncertainty assigned by TRC = 2. K |
Tfus | 269.6 | K | N/A | Koelbel, 1949 | Uncertainty assigned by TRC = 1.5 K |

Kovats' RI, non-polar column, isothermal

Column type | Active phase | Temperature (C) | I | Reference | Comment |
---|---|---|---|---|---|
Packed | OV-1 | 150. | 1470. | Antal, 1984 | Chromosorb W HP; Column length: 2.5 m |
Packed | OV-3 | 150. | 1511. | Antal, 1984 | Chromosorb W HP; Column length: 2.5 m |
Capillary | Apiezon L | 200. | 1452. | Klemm, Shabtai, et al., 1981 | |
Packed | OV-1 | 150. | 1470. | Bartik, Jánosi, et al., 1980 | Chromosorb W HP; Column length: 2.5 m |
Capillary | OV-1 | 130. | 1465. | Engewald, Wennrich, et al., 1979 | Column length: 50. m; Column diameter: 0.23 mm |

Lee's RI, non-polar column, temperature ramp

Column type | Active phase | I | Reference | Comment |
---|---|---|---|---|
Capillary | CP Sil 8 CB | 254.5 | Bundt, Herbel, et al., 1991 | 50. m/0.25 mm/0.25 μm, He, 4. K/min; Tstart: 80. C; Tend: 300. C |

References

Luther, 1955
Luther, H.,
Private Communication 1955, 1955. [all data]
Koelbel, 1949
Koelbel, H.,
Alkylnaphthalenes as Lubricating-oil Models,
Brennst.-Chem., 1949, 30, 73-80. [all data]