(S)-(+)-2-Amino-3-methyl-1-butanol
- Formula: C5H13NO
- Molecular weight: 103.1628
- IUPAC Standard InChIKey: NWYYWIJOWOLJNR-YFKPBYRVSA-N
- CAS Registry Number: 2026-48-4
- Chemical structure:
View 3d structure (requires JavaScript / HTML 5) - Stereoisomers:
- Other names: L-Valinol; (S)-2-Amino-3-methylbutanol; 1-Butanol, 2-amino-3-methyl-, (S)-; L-2-amino-3-methylbutan-1-ol

Phase change data

Data compiled by: Robert L. Brown and Stephen E. Stein
Reduced pressure boiling point
Tboil (K) | Pressure (bar) | Reference |
---|---|---|
354.2 | 0.01 | Aldrich Chemical Company Inc., 1990 |

References

Aldrich Chemical Company Inc., 1990
Aldrich Chemical Company Inc.,
Catalog Handbook of Fine Chemicals, Aldrich Chemical Company, Inc., Milwaukee WI, 1990, 1. [all data]