1,4-Dihydrophenanthrene
- Formula: C14H12
- Molecular weight: 180.2451
- IUPAC Standard InChIKey: KDJVIRKNAAXMBU-UHFFFAOYSA-N
- CAS Registry Number: 20244-28-4
- Chemical structure:
View 3d structure (requires JavaScript / HTML 5) - Permanent link for this species. Use this link for bookmarking this species for future reference.

Gas phase thermochemistry data

Data compiled by: Glushko Thermocenter, Russian Academy of Sciences, Moscow
Constant pressure heat capacity of gas
Cp,gas (J/mol*K) | Temperature (K) | Reference | Comment |
---|---|---|---|
47.16 | 50. | Dorofeeva O.V., 1988 | Recommended values were calculated statistically mechanically using force field approximation for polycyclic aromatic hydrocarbons to estimate the needed vibrational frequencies (see also [ Dorofeeva O.V., 1986]). These functions are reproduced in the reference book [ Frenkel M., 1994]. |
69.46 | 100. | ||
96.10 | 150. | ||
126.74 | 200. | ||
176.31 | 273.15 | ||
193.7 ± 2.5 | 298.15 | ||
195.00 | 300. | ||
261.59 | 400. | ||
318.48 | 500. | ||
364.77 | 600. | ||
402.29 | 700. | ||
433.02 | 800. | ||
458.50 | 900. | ||
479.82 | 1000. | ||
497.80 | 1100. | ||
513.06 | 1200. | ||
526.07 | 1300. | ||
537.22 | 1400. | ||
546.82 | 1500. |

References

Dorofeeva O.V., 1988
Dorofeeva O.V.,
Thermodynamic Properties of Polycyclic Aromatic Hydrocarbons in the Gaseous Phase. Institute for High Temperatures, USSR Academy of Sciences, Preprint No.1-238 (in Russian), Moscow, 1988. [all data]
Dorofeeva O.V., 1986
Dorofeeva O.V.,
On calculation of thermodynamic properties of polycyclic aromatic hydrocarbons,
Thermochim. Acta, 1986, 102, 59-66. [all data]
Frenkel M., 1994
Frenkel M.,
Thermodynamics of Organic Compounds in the Gas State, Vol. I, II, Thermodynamics Research Center, College Station, Texas, 1994, 1994. [all data]