Benz[j]aceanthrylene
- Formula: C20H12
- Molecular weight: 252.3093
- IUPAC Standard InChIKey: OSKRAISUPBTHCP-UHFFFAOYSA-N
- CAS Registry Number: 202-33-5
- Chemical structure:
View 3d structure (requires JavaScript / HTML 5) - Permanent link for this species. Use this link for bookmarking this species for future reference.

Gas phase thermochemistry data

Data compiled by: Glushko Thermocenter, Russian Academy of Sciences, Moscow
Constant pressure heat capacity of gas
Cp,gas (J/mol*K) | Temperature (K) | Reference | Comment |
---|---|---|---|
49.58 | 50. | Dorofeeva O.V., 1989 | These statistically calculated values were obtained using force field approximation for polycyclic aromatic hydrocarbons to estimate the needed vibrational frequencies (see also [ Dorofeeva O.V., 1986, Moiseeva N.F., 1990]). These functions are reproduced in the reference book [ Frenkel M., 1994]. |
81.15 | 100. | ||
119.47 | 150. | ||
162.69 | 200. | ||
230.03 | 273.15 | ||
253.0 ± 3.0 | 298.15 | ||
254.71 | 300. | ||
340.63 | 400. | ||
412.36 | 500. | ||
469.77 | 600. | ||
515.58 | 700. | ||
552.57 | 800. | ||
582.83 | 900. | ||
607.90 | 1000. | ||
628.86 | 1100. | ||
646.53 | 1200. | ||
661.52 | 1300. | ||
674.31 | 1400. | ||
685.29 | 1500. |

References

Dorofeeva O.V., 1989
Dorofeeva O.V.,
Thermodynamic Properties of Gaseous Polycyclic Aromatic Hydrocarbons Containing Five-Membered Rings. Institute for High Temperatures, USSR Academy of Sciences, Preprint No.1-263 (in Russian), Moscow, 1989. [all data]
Dorofeeva O.V., 1986
Dorofeeva O.V.,
On calculation of thermodynamic properties of polycyclic aromatic hydrocarbons,
Thermochim. Acta, 1986, 102, 59-66. [all data]
Moiseeva N.F., 1990
Moiseeva N.F.,
Group additivity scheme for calculating the chemical thermodynamic properties of gaseous polycyclic aromatic hydrocarbons containing five-membered rings,
Thermochim. Acta, 1990, 168, 179-186. [all data]
Frenkel M., 1994
Frenkel M.,
Thermodynamics of Organic Compounds in the Gas State, Vol. I, II, Thermodynamics Research Center, College Station, Texas, 1994, 1994. [all data]