Benzenepropanoic acid, ethyl ester
- Formula: C11H14O2
- Molecular weight: 178.2277
- IUPAC Standard InChIKey: JAGZUIGGHGTFHO-UHFFFAOYSA-N
- CAS Registry Number: 2021-28-5
- Chemical structure:
View 3d structure (requires JavaScript / HTML 5) - Other names: Hydrocinnamic acid, ethyl ester; Ethyl dihydrocinnamate; Ethyl hydrocinnamate; Ethyl 3-phenylpropanoate; Ethyl 3-phenylpropionate; Ethyl benzenepropanoate; Ethylphenyl propanoate; Ethyl 2,3-dihydrocinnamate; ethyl 3-phenylproprionate

Condensed phase thermochemistry data

Data compiled as indicated in comments:
ALS - Hussein Y. Afeefy, Joel F. Liebman, and Stephen E. Stein
DH - Eugene S. Domalski and Elizabeth D. Hearing
Quantity | Value | Units | Method | Reference | Comment |
---|---|---|---|---|---|
ΔcH°liquid | -5906.3 ± 4.7 | kJ/mol | Ccb | Roth and Muller, 1929 | Corresponding ΔfHºliquid = -423.10 kJ/mol (simple calculation by NIST; no Washburn corrections); ALS |
Constant pressure heat capacity of liquid
Cp,liquid (J/mol*K) | Temperature (K) | Reference | Comment |
---|---|---|---|
286.6 | 298. | von Reis, 1881 | T = 289 to 457 K.; DH |

Phase change data

Data compiled as indicated in comments:
BS - Robert L. Brown and Stephen E. Stein
TRC - Thermodynamics Research Center, NIST Boulder Laboratories, Chris Muzny director
Quantity | Value | Units | Method | Reference | Comment |
---|---|---|---|---|---|
Tboil | 520.4 | K | N/A | Weast and Grasselli, 1989 | BS |
Tboil | 520.4 | K | N/A | Perkin, 1896 | Uncertainty assigned by TRC = 1. K; TRC |

Kovats' RI, non-polar column, temperature ramp

Column type | Active phase | I | Reference | Comment |
---|---|---|---|---|
Capillary | HP-5MS | 1324. | Gkinis, Tzakou, et al., 2003 | 30. m/0.25 mm/0.25 μm, He, 3. K/min; Tstart: 60. C; Tend: 280. C |
Capillary | DB-5 | 1390.4 | El-Massry, El-Ghorab, et al., 2002 | 30. m/0.25 mm/0.5 μm, 50. C @ 3. min, 7. K/min, 250. C @ 10. min |
Capillary | DB-5 | 1355. | Tzakou, Harvala, et al., 2000 | 50. C @ 5. min, 3. K/min; Column length: 30. m; Column diameter: 0.32 mm; Tend: 250. C |

Kovats' RI, polar column, temperature ramp

Column type | Active phase | I | Reference | Comment |
---|---|---|---|---|
Capillary | Carbowax 20M | 1846. | Nishimura, Yamaguchi, et al., 1989 | 2. K/min; Column length: 50. m; Column diameter: 0.22 mm; Tstart: 80. C; Tend: 200. C |

Van Den Dool and Kratz RI, non-polar column, temperature ramp

Column type | Active phase | I | Reference | Comment |
---|---|---|---|---|
Capillary | DB-5 | 1360. | Fang and Qian, 2005 | 30. m/0.32 mm/1. μm, N2, 40. C @ 2. min, 4. K/min, 230. C @ 10. min |
Capillary | HP-5 | 1350. | Mahattanatawee, Goodner, et al., 2005 | 30. m/0.25 mm/0.25 μm, He, 50. C @ 5. min, 4. K/min, 250. C @ 15. min |
Capillary | HP-5 | 1348. | Mahattanatawee, Goodner, et al., 2005 | 30. m/0.25 mm/0.25 μm, He, 50. C @ 5. min, 4. K/min, 250. C @ 15. min |

Van Den Dool and Kratz RI, non-polar column, custom temperature program

Column type | Active phase | I | Reference | Comment |
---|---|---|---|---|
Capillary | DB-5 | 1370. | Escudero, Campo, et al., 2007 | Program: not specified |
Capillary | SE-54 | 1350. | Fritsch and Schieberle, 2005 | 30. m/0.32 mm/0.25 μm, He; Program: 35C(2min) => 40C/min => 50C(2min) => 6C/min => 180C => 20C/min => 230C(10min) |
Capillary | DB-5 | 1360. | Wang, Finn, et al., 2005 | 30. m/0.32 mm/1. μm, He; Program: 40C(2min) => 5C/min => 100C => 4C/min => 230C (10min) |

Van Den Dool and Kratz RI, polar column, temperature ramp

Column type | Active phase | I | Reference | Comment |
---|---|---|---|---|
Capillary | DB-Wax | 1914. | Petka, Ferreira, et al., 2006 | 30. m/0.32 mm/0.5 μm, 40. C @ 3. min, 5. K/min, 200. C @ 8. min |
Capillary | Supelcowax-10 | 1854. | Chung, Fung, et al., 2005 | 60. m/0.25 mm/0.25 μm, 35. C @ 5. min, 6. K/min, 195. C @ 60. min |
Capillary | Stabilwax | 1909. | Fang and Qian, 2005 | 30. m/0.32 mm/1. μm, N2, 40. C @ 2. min, 4. K/min, 230. C @ 10. min |
Capillary | ZB-Wax | 1879. | Ledauphin, Saint-Clair, et al., 2004 | 30. m/0.25 mm/0.15 μm, He, 35. C @ 10. min, 1.8 K/min, 220. C @ 10. min |
Capillary | Supelcowax-10 | 1892. | Chung, 2000 | 60. m/0.25 mm/0.25 μm, He, 2. K/min, 195. C @ 90. min; Tstart: 35. C |
Capillary | Supelcowax-10 | 1892. | Chung, 1999 | 60. m/0.25 mm/0.25 μm, He, 35. C @ 5. min, 2. K/min, 195. C @ 90. min |

Van Den Dool and Kratz RI, polar column, custom temperature program

Column type | Active phase | I | Reference | Comment |
---|---|---|---|---|
Capillary | DB-Wax | 1907. | Escudero, Campo, et al., 2007 | 30. m/0.32 mm/0.5 μm, H2; Program: 40C(5min) => 4C/min => 100C6C/min => 136C => 3C/min => 220C (10min) |
Capillary | FFAP | 1876. | Fritsch and Schieberle, 2005 | 30. m/0.32 mm/0.25 μm, He; Program: 35C(2min) => 40C/min => 60C(2min) => 6C/min => 180C => 20C/min => 230C(10min) |

Normal alkane RI, non-polar column, temperature ramp

Column type | Active phase | I | Reference | Comment |
---|---|---|---|---|
Capillary | DB-5 | 1353. | Fan and Qian, 2006 | 30. m/0.32 mm/1. μm, He, 40. C @ 2. min, 4. K/min, 250. C @ 15. min |
Capillary | DB-5 | 1349. | Fan and Qian, 2006, 2 | 30. m/0.32 mm/1. μm, N2, 40. C @ 2. min, 6. K/min, 230. C @ 15. min |
Capillary | DB-5 | 1353. | Fan and Qian, 2005 | 30. m/0.32 mm/0.25 μm, N2, 40. C @ 2. min, 4. K/min, 250. C @ 5. min |
Capillary | SPB-5 | 1354. | Ledauphin, Guichard, et al., 2003 | 30. m/0.32 mm/0.25 μm, He, 40. C @ 1. min, 5. K/min, 220. C @ 20. min |
Capillary | BP-5 | 1357. | Lopez, Ferreira, et al., 1999 | 50. m/0.32 mm/1. μm, He, 40. C @ 5. min, 2. K/min; Tend: 190. C |
Capillary | CP Sil 5 CB | 1320. | Weyerstahl, Marschall, et al., 1999 | N2, 5. K/min; Column length: 25. m; Phase thickness: 0.39 μm; Tstart: 60. C; Tend: 220. C |

Normal alkane RI, non-polar column, custom temperature program

Column type | Active phase | I | Reference | Comment |
---|---|---|---|---|
Capillary | Polydimethyl siloxane with 5 % Ph groups | 1350. | Robinson, Adams, et al., 2012 | Program: not specified |
Capillary | Polydimethyl siloxane with 5 % Ph groups | 1360. | Robinson, Adams, et al., 2012 | Program: not specified |
Capillary | DB-5 | 1352. | San-Juan, Petka, et al., 2010 | 30. m/0.32 mm/0.50 μm, Hydrogen; Program: 40 0C (5 min) 4 0C/min -> 100 0C 6 0C/min -> 220 0C (20 min) |
Capillary | SLB-5 MS | 1352. | Costa, De Fina, et al., 2008 | 30. m/0.25 mm/0.25 μm, Helium; Program: 50 0C 3 0C/min -> 250 0C (1 min) 10 0C/min -> 300 0C (5 min) |
Capillary | SLB-5 MS | 1352. | Costa, De Fina, et al., 2008 | 30. m/0.25 mm/0.25 μm, Helium; Program: not specified |
Capillary | HP-5 | 1353. | Zhao, Li, et al., 2008 | 30. m/0.25 mm/0.25 μm; Program: 40 0C (2 min) 5 0C/min -> 80 0C 7 oC/min -> 160 0C 9 0C/min -> 200 0C 20 0C/min -> 280 0C (10 min) |
Capillary | HP-5 | 1347. | Zhao, Li, et al., 2008 | 30. m/0.25 mm/0.25 μm; Program: not specified |
Capillary | MFE-73 | 1353. | Escudero, Gogorza, et al., 2004 | Program: not specified |
Capillary | HP-5 | 1351. | Jordán, Margaría, et al., 2003 | 30. m/0.25 mm/0.25 μm; Program: 40C(6min) => 2.5C/min => 150C => 90C/min => 250C |
Capillary | HP-5MS | 1347. | Martí, Mestres, et al., 2003 | 30. m/0.25 mm/0.25 μm, He; Program: 40C(5min) => 2C/min => 120C => 10C/min => 210C (30min) |
Capillary | MFE-73 | 1353. | Ferreira, Ortín, et al., 2002 | H2; Program: not specified |
Capillary | MFE-73 | 1353. | Aznar, López, et al., 2001 | 30. m/0.32 mm/0.1 μm, H2; Program: 40C(5min) => 2C/min => 120C => 10C/min => 210C(30min) |
Capillary | MFE-73 | 1353. | Ferreira, Aznar, et al., 2001 | 30. m/0.32 mm/0.1 μm, H2; Program: 40 C (5min) => 2C/min => 120C => 10 C/min => 210 C (30min) |
Capillary | CP Sil 5 CB | 1320. | Weyerstahl, Marschall, et al., 1998 | He; Column length: 25. m; Phase thickness: 0.39 μm; Program: not specified |

Normal alkane RI, polar column, temperature ramp

Column type | Active phase | I | Reference | Comment |
---|---|---|---|---|
Capillary | DB-Wax | 1872. | Fan and Qian, 2006 | 30. m/0.32 mm/0.25 μm, He, 40. C @ 2. min, 4. K/min, 230. C @ 15. min |
Capillary | DB-Wax | 1880. | Fan and Qian, 2006, 2 | 30. m/0.32 mm/0.25 μm, N2, 40. C @ 2. min, 6. K/min, 230. C @ 15. min |
Capillary | DB-Wax | 1878. | Fan and Qian, 2005 | 30. m/0.32 mm/0.25 μm, N2, 40. C @ 2. min, 4. K/min, 230. C @ 5. min |
Capillary | DB-Wax | 1905. | Culleré, Escudero, et al., 2004 | 30. m/0.32 mm/0.5 μm, H2, 40. C @ 5. min, 4. K/min; Tend: 200. C |
Capillary | DB-Wax | 1900. | López, Ezpeleta, et al., 2004 | 60. m/0.25 mm/0.25 μm, He, 40. C @ 5. min, 3. K/min; Tend: 220. C |
Capillary | DB-Wax | 1906. | López, Ortín, et al., 2003 | 30. m/0.32 mm/0.5 μm, H2, 40. C @ 5. min, 4. K/min; Tend: 200. C |
Capillary | DB-Wax | 1903. | Ferreira, Ortín, et al., 2002 | 30. m/0.32 mm/0.5 μm, H2, 40. C @ 5. min, 4. K/min; Tend: 200. C |
Capillary | DB-Wax | 1897. | Aznar, López, et al., 2001 | 30. m/0.32 mm/0.5 μm, H2, 40. C @ 5. min, 4. K/min, 200. C @ 60. min |
Capillary | DB-Wax | 1897. | Ferreira, Aznar, et al., 2001 | 30. m/0.32 mm/0.5 μm, H2, 40. C @ 5. min, 4. K/min, 200. C @ 60. min |
Capillary | Carbowax 20M | 1900. | Lopez, Ferreira, et al., 1999 | 60. m/0.32 mm/0.5 μm, He, 40. C @ 5. min, 2. K/min; Tend: 190. C |
Capillary | DB-Wax | 1899. | Weyerstahl, Marschall, et al., 1999 | N2, 5. K/min; Column length: 60. m; Phase thickness: 0.25 μm; Tstart: 60. C; Tend: 220. C |
Capillary | DB-Wax | 1878. | Werkhoff, Güntert, et al., 1998 | 60. m/0.32 mm/0.25 μm, H2, 3. K/min; Tstart: 60. C; Tend: 220. C |

Normal alkane RI, polar column, custom temperature program

Column type | Active phase | I | Reference | Comment |
---|---|---|---|---|
Capillary | DB-Wax | 1872. | Welke, Manfroi, et al., 2012 | 30. m/0.25 mm/0.25 μm, Helium; Program: not specified |
Capillary | DB-Wax | 1892. | Welke, Manfroi, et al., 2012 | 30. m/0.25 mm/0.25 μm, Helium; Program: not specified |
Capillary | Innowax FSC | 1904. | Polatoglu, Demirci, et al., 2010 | 60. m/0.25 mm/0.25 μm, Helium; Program: 60 0C (10 min) 4 0C/min -> 220 0C (10 min) 1 0C/min -> 240 0C |
Capillary | DB-Wax | 1886. | San-Juan, Petka, et al., 2010 | 30. m/0.32 mm/0.50 μm, Hydrogen; Program: 40 0C (5 min) 4 0C/min -> 100 0C 6 0C/min -> 220 0C (20 min) |
Capillary | DB-Wax | 1886. | Ferreira, Juan, et al., 2009 | 30. m/0.32 mm/0.50 μm; Program: 40 0C (5 min) 4 0C/min -> 100 0C 6 0C/min -> 220 0C (40 min) |
Capillary | DB-Wax | 1908. | Loscos, Hernandez-Orte, et al., 2009 | 60. m/0.25 mm/0.50 μm, Helium; Program: 40 0C (3 min) 10 0C/min -> 90 0C 2 0C/min -> 230 0C (37 min) |
Capillary | DB-Wax | 1862. | Tao, Wenlai, et al., 2008 | 30. m/0.32 mm/0.25 μm, Helium; Program: 50 0C 20 0C/min -> 80 0C 3 0C/min -> 230 0C |
Capillary | DB-Wax Etr | 1908. | Loskos, Hernandez-Orte, et al., 2007 | 60. m/0.25 mm/0.5 μm, He; Program: 40C(3min) => 10C/min => 90C => 2C/min => 230C (37min) |
Capillary | DB-Wax | 1903. | Escudero, Gogorza, et al., 2004 | Program: not specified |
Capillary | CP-WAX 57CB | 1905. | Martí, Mestres, et al., 2003 | 50. m/0.25 mm/0.2 μm, He; Program: 40C(10min) => 5C/min => 100C => 3C/min => 180C => 20C/min => 210C (10min) |
Capillary | Supelcowax-10 | 1861. | Rogerson and de Freitas, 2002 | 60. m/0.25 mm/0.25 μm, He; Program: 40C(20min) => (1.5C/min) => 200C => (10C/min) => 250C(120min) |
Capillary | DB-Wax | 1893. | Weyerstahl, Marschall, et al., 1998 | N2; Column length: 60. m; Phase thickness: 0.25 μm; Program: not specified |

References

Roth and Muller, 1929
Roth, W.A.; Muller, Fr.,
Die Zersetzungswarme der Stickstoffwasserstoffsaure,
Ber., 1929, 62, 1188-1194. [all data]
von Reis, 1881
von Reis, M.A.,
Die specifische Wärme flüssiger organischer Verbindungen und ihre Beziehung zu deren Moleculargewicht,
Ann. Physik [3], 1881, 13, 447-464. [all data]
Weast and Grasselli, 1989
CRC Handbook of Data on Organic Compounds, 2nd Editon, Weast,R.C and Grasselli, J.G., ed(s)., CRC Press, Inc., Boca Raton, FL, 1989, 1. [all data]
Perkin, 1896
Perkin, W.H.,
LXIX. On Magnetic Rotatory Power, especially of Aromatic Compounds,
J. Chem. Soc., 1896, 69, 1025-1257. [all data]
Gkinis, Tzakou, et al., 2003
Gkinis, G.; Tzakou, O.; Iliopoulou, D.; Roussis, V.,
Chemical Composition and Biological Activity of Nepeta parnassica Oils and Isolated Nepetalactones,
Z. Naturforsch. C:, 2003, 58, 681-686. [all data]
El-Massry, El-Ghorab, et al., 2002
El-Massry, K.F.; El-Ghorab, A.H.; Farouk, A.,
Antioxidant activity and volatile components of Egyptian Artemisia judaica L.,
Food Chem., 2002, 79, 3, 331-336, https://doi.org/10.1016/S0308-8146(02)00164-4
. [all data]
Tzakou, Harvala, et al., 2000
Tzakou, O.; Harvala, C.; Galati, E.M.; Sanogo, R.,
Essential oil composition of Nepeta argolica Borey et Chaub. subsp. argolica,
Flavour Fragr. J., 2000, 15, 2, 115-118, https://doi.org/10.1002/(SICI)1099-1026(200003/04)15:2<115::AID-FFJ877>3.0.CO;2-9
. [all data]
Nishimura, Yamaguchi, et al., 1989
Nishimura, O.; Yamaguchi, K.; Mihara, S.; Shibamoto, T.,
Volatile Constituents of Guava Fruits (Psidium guajava L.) and Canned Puree,
J. Agric. Food Chem., 1989, 37, 1, 139-142, https://doi.org/10.1021/jf00085a033
. [all data]
Fang and Qian, 2005
Fang, Y.; Qian, M.,
Aroma compounds in Oregon Pinot Noir wine determined by aroma extract dilution analysis (AEDA),
Flavour Fragr. J., 2005, 20, 1, 22-29, https://doi.org/10.1002/ffj.1551
. [all data]
Mahattanatawee, Goodner, et al., 2005
Mahattanatawee, K.; Goodner, K.L.; Baldwin, E.A.,
Volatile constituents and character impact compounds of selected Florida's tropical fruit,
Proc. Fla. State Hort. Soc., 2005, 118, 414-418. [all data]
Escudero, Campo, et al., 2007
Escudero, A.; Campo, E.; Fariña, L.; Cacho, J.; Ferreira, V.,
Analytical Characterization of the Aroma of Five Premium Red Wines. Insights into the Role of Odor Families and the Concept of Fruitiness of Wines,
J. Agric. Food Chem., 2007, 55, 11, 4501-4510, https://doi.org/10.1021/jf0636418
. [all data]
Fritsch and Schieberle, 2005
Fritsch, H.T.; Schieberle, P.,
Identification based on quantitative measurements and aroma recombination of the character impact odorants in a Bavarian Pilsner-type beer,
J. Agric. Food Chem., 2005, 53, 19, 7544-7551, https://doi.org/10.1021/jf051167k
. [all data]
Wang, Finn, et al., 2005
Wang, Y.; Finn, C.; Qian, M.C.,
Impact of Growing Environment on Chickasaw Blackberry ( Rubus L.) Aroma Evaluated by Gas Chromatography Olfactometry Dilution Analysis,
J. Agric. Food Chem., 2005, 53, 9, 3563-3571, https://doi.org/10.1021/jf048102m
. [all data]
Petka, Ferreira, et al., 2006
Petka, J.; Ferreira, V.; González-Viñas, M.A.; Cacho, J.,
Sensory and Chemical Characterization of the Aroma of a White Wine Made with Devín Grapes,
J. Agric. Food Chem., 2006, 54, 3, 909-915, https://doi.org/10.1021/jf0518397
. [all data]
Chung, Fung, et al., 2005
Chung, H.Y.; Fung, P.K.; Kim, J.-S.,
Aroma impact components in commercial plain sufu,
J. Agric. Food Chem., 2005, 53, 5, 1684-1691, https://doi.org/10.1021/jf048617d
. [all data]
Ledauphin, Saint-Clair, et al., 2004
Ledauphin, J.; Saint-Clair, J.-F.; Lablanquie, O.; Guichard, H.; Founier, N.; Guichard, E.; Barillier, D.,
Identification of trace volatile compounds in freshly distilled calvados and cognac using preparative separations coupled with gas chromatography-mass spectrometry,
J. Agric. Food Chem., 2004, 52, 16, 5124-5134, https://doi.org/10.1021/jf040052y
. [all data]
Chung, 2000
Chung, H.Y.,
Volatile flavor components in red fermented soybean (Glycine max) curds,
J. Agric. Food Chem., 2000, 48, 5, 1803-1809, https://doi.org/10.1021/jf991272s
. [all data]
Chung, 1999
Chung, H.Y.,
Volatile components in fermented soybean (Glycine max) curds,
J. Agric. Food Chem., 1999, 47, 7, 2690-2696, https://doi.org/10.1021/jf981166a
. [all data]
Fan and Qian, 2006
Fan, W.; Qian, M.C.,
Characterization of Aroma Compounds of Chinese Wuliangye and Jiannanchun Liquors by Aroma Extract Dilution Analysis,
J. Agric. Food Chem., 2006, 54, 7, 2695-2704, https://doi.org/10.1021/jf052635t
. [all data]
Fan and Qian, 2006, 2
Fan, W.; Qian, M.C.,
Identification of aroma compounds in Chinese 'Yanghe Daqu' liquor by normal phase chromatography fractionation followed by gas chromatography/olfactometry,
Flavour Fragr. J., 2006, 21, 2, 333-342, https://doi.org/10.1002/ffj.1621
. [all data]
Fan and Qian, 2005
Fan, W.; Qian, M.C.,
Headspace Solid Phase Microextraction and Gas Chromatography-Olfactometry Dilution Analysis of Young and Aged Chinese Yanghe Daqu Liquors,
J. Agric. Food Chem., 2005, 53, 20, 7931-7938, https://doi.org/10.1021/jf051011k
. [all data]
Ledauphin, Guichard, et al., 2003
Ledauphin, J.; Guichard, H.; Saint-Clair, J.-F.; Picoche, B.; Barillier, D.,
Chemical and sensorial aroma characterization of freshly distilled calvados. 2. Identification of volatile compounds and key odorants,
J. Agric. Food Chem., 2003, 51, 2, 433-442, https://doi.org/10.1021/jf020373e
. [all data]
Lopez, Ferreira, et al., 1999
Lopez, R.; Ferreira, V.; Hernandez, P.; Cacho, J.F.,
Identification of impact odorants of young red wines made with Merlot, Cabernet Sauvignon and Grenache grape varieties: a comparative study,
J. Sci. Food Agric., 1999, 79, 11, 1461-1467, https://doi.org/10.1002/(SICI)1097-0010(199908)79:11<1461::AID-JSFA388>3.0.CO;2-K
. [all data]
Weyerstahl, Marschall, et al., 1999
Weyerstahl, P.; Marschall, H.; Thefeld, K.; Rustaiyan, A.,
Constituents of the essential oil of Tanacetum (syn. Chrysanthemum) fruticulosum Ledeb. from Iran,
Flavour Fragr. J., 1999, 14, 2, 112-120, https://doi.org/10.1002/(SICI)1099-1026(199903/04)14:2<112::AID-FFJ786>3.0.CO;2-1
. [all data]
Robinson, Adams, et al., 2012
Robinson, A.L.; Adams, D.O.; Boss, P.K.; Heymann, H.; Solomon, P.S.; Trengove, R.D.,
Influence of geographic origine on the sensory characteristics and wine composition of Vitus viniferas cv. Cabernet Sauvignon wines from Australia (Supplemental data),
Am. J. Enol. Vitic., 2012, 64, 4, 467-476, https://doi.org/10.5344/ajev.2012.12023
. [all data]
San-Juan, Petka, et al., 2010
San-Juan, F.; Petka, J.; Cacho, J.; Ferreira, V.; Escudero, A.,
Producing headspace extracts for the gas chromatography - olphactometric evaluation of wine aroma,
Food Chemistry, 2010, 123, 1, 188-195, https://doi.org/10.1016/j.foodchem.2010.03.129
. [all data]
Costa, De Fina, et al., 2008
Costa, R.; De Fina, M.R.; Valentino, M.R.; Rustaiyan, A.; Dugo, P.; Dugo, G.; Mondello, L.,
An investigation on the volatile composition of some Artemisia species from Iran,
Flavour Fragr. J., 2008, 24, 2, 75-82, https://doi.org/10.1002/ffj.1919
. [all data]
Zhao, Li, et al., 2008
Zhao, Y.; Li, J.; Xu, Y.; Duan, H.; Fan, W.; Zhao, G.,
EXtraction, preparation and identification of volatile compounds in Changyu XO brandy,
Chinese J. Chromatogr., 2008, 26, 2, 212-222, https://doi.org/10.1016/S1872-2059(08)60014-0
. [all data]
Escudero, Gogorza, et al., 2004
Escudero, A.; Gogorza, B.; Melús, M.A.; Ortín, N.; Cacho, J.; Ferreira, V.,
Characterization of the aroma of a wine from Maccabeo. Key role played by compounds with low odor activity values,
J. Agric. Food Chem., 2004, 52, 11, 3516-3524, https://doi.org/10.1021/jf035341l
. [all data]
Jordán, Margaría, et al., 2003
Jordán, M.J.; Margaría, C.A.; Shaw, P.E.; Goodner, K.L.,
Volatile components and aroma active compounds in aqueous essence and fresh pink guava fruid puree (Psidium guajava L.) by GC-MS and multidimensional GC/GC-O,
J. Agric. Food Chem., 2003, 51, 5, 1421-1426, https://doi.org/10.1021/jf020765l
. [all data]
Martí, Mestres, et al., 2003
Martí, M.P.; Mestres, M.; Sala, C.; Busto, O.; Guasch, J.,
Solid-phase microextraction and gas chromatography olfactometry analysis of successively diluted samples. A new approach of the aroma extract dilution analysis applied to the characterization of wine aroma,
J. Agric. Food Chem., 2003, 51, 27, 7861-7865, https://doi.org/10.1021/jf0345604
. [all data]
Ferreira, Ortín, et al., 2002
Ferreira, V.; Ortín, N.; Escudero, A.; López, R.; Cacho, J.,
Chemical characterization of the aroma of grenache Rosé wines: aroma extract dilution analysis, quantitative determination, and sensory reconstitution studies,
J. Agric. Food Chem., 2002, 50, 14, 4048-4054, https://doi.org/10.1021/jf0115645
. [all data]
Aznar, López, et al., 2001
Aznar, M.; López, R.; Cacho, J.F.; Ferreira, V.,
Identification and quantification of impact odorants of aged red wines from Rioja. GC-olfactometry, quantitative GC-MS, and odor evaluation of HPLC fractions,
J. Agric. Food Chem., 2001, 49, 6, 2924-2929, https://doi.org/10.1021/jf001372u
. [all data]
Ferreira, Aznar, et al., 2001
Ferreira, V.; Aznar, M.; López, R.; Cacho, J.,
Quantitative gas chromatography-olfactometry carried out at different dilutions of an extract. Differences in the odor profiles of four high-quality spanish aged red wines,
J. Agric. Food Chem., 2001, 49, 10, 4818-4824, https://doi.org/10.1021/jf010283u
. [all data]
Weyerstahl, Marschall, et al., 1998
Weyerstahl, P.; Marschall, H.; Weirauch, M.; Thefeld, K.; Surburg, H.,
Constituents of commercial Labdanum oil,
Flavour Fragr. J., 1998, 13, 5, 295-318, https://doi.org/10.1002/(SICI)1099-1026(1998090)13:5<295::AID-FFJ751>3.0.CO;2-I
. [all data]
Culleré, Escudero, et al., 2004
Culleré, L.; Escudero, A.; Cacho, J.; Ferreira, V.,
Gas chromatography-olfactometry and chemical quantitative study of the aroma of six premium auality Spanish aged red wines,
J. Agric. Food Chem., 2004, 52, 6, 1653-1660, https://doi.org/10.1021/jf0350820
. [all data]
López, Ezpeleta, et al., 2004
López, R.; Ezpeleta, E.; Sánchez, I.; Cacho, J.; Ferreira, V.,
Analysis of the aroma intensities of volatile compounds released from mild acid hydrolysates of odourless precursors extracted from Tempranillo and Grenache grapes using gas chromatography-olfactometry,
Food Chem., 2004, 88, 1, 95-103, https://doi.org/10.1016/j.foodchem.2004.01.025
. [all data]
López, Ortín, et al., 2003
López, R.; Ortín, N.; Pérez-Trujillo, J.P.; Cacho, J.; Ferreira, V.,
Impact odorants of different young white wines from the Canary islands,
J. Agric. Food Chem., 2003, 51, 11, 3419-3425, https://doi.org/10.1021/jf026045w
. [all data]
Werkhoff, Güntert, et al., 1998
Werkhoff, P.; Güntert, M.; Krammer, G.; Sommer, H.; Kaulen, J.,
Vacuum headspace method in aroma research: flavor chemistry of yellow passion fruits,
J. Agric. Food Chem., 1998, 46, 3, 1076-1093, https://doi.org/10.1021/jf970655s
. [all data]
Welke, Manfroi, et al., 2012
Welke, J.E.; Manfroi, V.; Zanus, M.; Lazarotto, M.; Zini, C.A.,
Characterization of the volatile profile of Brazilian merlot wines through comprehensive two dimensional gas chromatography time-of-flight mass spectrometric detection,
J. Chromatogr. A, 2012, 1226, 124-139, https://doi.org/10.1016/j.chroma.2012.01.002
. [all data]
Polatoglu, Demirci, et al., 2010
Polatoglu, K.; Demirci, F.; Demirci, B.; Goren, N.; Baser, K.H.C.,
Antimicrobial activity and essential oil composition of a new T. argyrophyllum (C. Koch) Tvzel var. argyrophyllium chemotype,
J. Oleo Sci., 2010, 59, 6, 307-313, https://doi.org/10.5650/jos.59.307
. [all data]
Ferreira, Juan, et al., 2009
Ferreira, V.; Juan, F.S.; Escudero, A.; Cullere, L.; Fernandez-Zurbano, P.; Saenz-Navajas, M.P.; Cacho, J.,
Modeling quality of premium Spanish red wines from gas chromatography-olfactometry data,
J. Agr. Food. Chem., 2009, 57, 16, 7490-7498, https://doi.org/10.1021/jf9006483
. [all data]
Loscos, Hernandez-Orte, et al., 2009
Loscos, N.; Hernandez-Orte, P.; Cacho, J.; Ferreira, V.,
Fate of grape flavor precursors during storage on yeast lees,
J. Agric. Food Chem., 2009, 57, 12, 5468-5479, https://doi.org/10.1021/jf804057q
. [all data]
Tao, Wenlai, et al., 2008
Tao, L.; Wenlai, F.; Yan, X.,
Characterization of volatile and semi-volatile compounds in Chinese rica wines by headspace solid phase microextraction followed by gas chromatography - mass spectrometry,
J. Inst. Brew., 2008, 114, 2, 172-179, https://doi.org/10.1002/j.2050-0416.2008.tb00323.x
. [all data]
Loskos, Hernandez-Orte, et al., 2007
Loskos, N.; Hernandez-Orte, P.; Cacho, J.; Ferreira, V.,
Release and formation of varietal aroma compounds during alcoholic fermentation from nonfloral grape odorless flavor precursors fractions,
J. Agric. Food Chem., 2007, 55, 16, 6674-6684, https://doi.org/10.1021/jf0702343
. [all data]
Rogerson and de Freitas, 2002
Rogerson, F.S.S.; de Freitas, V.A.P.,
Fortification spirit, a contributor to the aroma complexity of port,
J. Food Sci., 2002, 67, 4, 1564-1569, https://doi.org/10.1111/j.1365-2621.2002.tb10323.x
. [all data]