2-Cyclohexen-1-one, 3,5,5-trimethyl-4-(3-oxo-1-butenyl)-

Van Den Dool and Kratz RI, non-polar column, custom temperature program

View large format table.

Column type Active phase I Reference Comment
CapillaryHP-5MS1661.1Andriamaharavo, 201430. m/0.25 mm/0.25 μm, He; Program: 60C (1 min) => 5 C/min => 210C => 10 C/min => 280C (15 min)

Van Den Dool and Kratz RI, polar column, temperature ramp

View large format table.

Column type Active phase I Reference Comment
CapillaryDB-Wax2067.Shimoda, Shigematsu, et al., 199560. m/0.25 mm/0.25 μm, 2. K/min; Tstart: 50. C; Tend: 230. C

Normal alkane RI, polar column, custom temperature program

View large format table.

Column type Active phase I Reference Comment
CapillaryHP-Innowax2078.Piasenzotto, Gracco, et al., 200330. m/0.32 mm/0.5 μm, He; Program: 50C(4min) => 10C/min => 230C(10min) => 10C/min => 250C

References

Andriamaharavo, 2014
Andriamaharavo, N.R., Retention Data. NIST Mass Spectrometry Data Center., NIST Mass Spectrometry Data Center, 2014. [all data]

Shimoda, Shigematsu, et al., 1995
Shimoda, M.; Shigematsu, H.; Shiratsuchi, H.; Osajima, Y., Comparison of the odor concentrates by SDE and adsorptive column method from green tea infusion, J. Agric. Food Chem., 1995, 43, 6, 1616-1620, https://doi.org/10.1021/jf00054a037 . [all data]

Piasenzotto, Gracco, et al., 2003
Piasenzotto, L.; Gracco, L.; Conte, L., Solid phase microextraction (SPME) applied to honey quality control, J. Sci. Food Agric., 2003, 83, 10, 1037-1044, https://doi.org/10.1002/jsfa.1502 . [all data]