1-Propanamine, N-ethyl-
- Formula: C5H13N
- Molecular weight: 87.1634
- IUPAC Standard InChIKey: XCVNDBIXFPGMIW-UHFFFAOYSA-N
- CAS Registry Number: 20193-20-8
- Chemical structure:
View 3d structure (requires JavaScript / HTML 5) - Other names: Propylamine, N-ethyl-; Ethylpropylamine; N-Ethyl-n-propylamine; N-Ethylpropanamine; N-Ethylpropylamine; N,N-Ethylpropylamine

Phase change data

Data compiled by: Thermodynamics Research Center, NIST Boulder Laboratories, Chris Muzny director
Quantity | Value | Units | Method | Reference | Comment |
---|---|---|---|---|---|
Tboil | 343.4 | K | N/A | Cope, Lebel, et al., 1957 | Uncertainty assigned by TRC = 1.5 K |

Reaction thermochemistry data

Data compiled by: Hussein Y. Afeefy, Joel F. Liebman, and Stephen E. Stein
Individual Reactions
By formula: H2 + C5H11N = C5H13N
Quantity | Value | Units | Method | Reference | Comment |
---|---|---|---|---|---|
ΔrH° | 89. ± 2. | kJ/mol | Chyd | Jackman and Packham, 1957 | liquid phase; solvent: bis-2-Ethoxyethyl ether |
By formula: H2 + C5H11N = C5H13N
Quantity | Value | Units | Method | Reference | Comment |
---|---|---|---|---|---|
ΔrH° | 93.7 ± 0.4 | kJ/mol | Cm | Jackman and Packham, 1957 | liquid phase; solvent: bis-2-Ethoxyethyl ether |

Kovats' RI, non-polar column, isothermal

Column type | Active phase | Temperature (C) | I | Reference | Comment |
---|---|---|---|---|---|
Packed | Apiezon L | 100. | 652. | Golovnya, Zhuravleva, et al., 1980 | N2, Chromosorb GAW; Column length: 2.7 m |

References

Cope, Lebel, et al., 1957
Cope, A.C.; Lebel, N.A.; Lee, H.-H.; Moore, W.R.,
Amine oxides: III selective formation of olefins from unsymmetrical amine oxides and quaternary ammonium hydroxides,
J. Am. Chem. Soc., 1957, 79, 4720. [all data]
Jackman and Packham, 1957
Jackman, L.M.; Packham, D.I.,
The experimental resonance energy of acridine,
Proc. Chem. Soc., London, 1957, 349-350. [all data]
Golovnya, Zhuravleva, et al., 1980
Golovnya, R.V.; Zhuravleva, N.L.; Svetlova, N.I.; Grigor'eva, D.N.,
Gas-chromatographic separation of secondary normal alphatic amines,
J. Anal. Chem. USSR (Engl. Transl.), 1980, 35, 10, 1280-1285. [all data]