L-Phenylalanine, N-acetyl-
- Formula: C11H13NO3
- Molecular weight: 207.2258
- IUPAC Standard InChIKey: CBQJSKKFNMDLON-JTQLQIEISA-N
- CAS Registry Number: 2018-61-3
- Chemical structure:
View 3d structure (requires JavaScript / HTML 5) - Other names: Alanine, N-acetyl-3-phenyl-, L-; Acetyl-L-phenylalanine; Acetylphenylalanine; L-N-Acetylphenylalanine; N-Acetyl-L-phenylalanine; N-Acetylphenylalanine; N-Acetyl-l-phenalanine; NSC 45699; N-acetyl-3-phenyl-L-alanine

Reaction thermochemistry data

Data compiled by: Robert C. Dunbar
Individual Reactions
By formula: Na+ + C11H13NO3 = (Na+ • C11H13NO3)
Free energy of reaction
ΔrG° (kJ/mol) | T (K) | Method | Reference |
---|---|---|---|
146. | 0. | CIDC | Feng, Gronert, et al., 1999 |

Ion clustering data

Data compiled by: Robert C. Dunbar
Clustering reactions
By formula: Na+ + C11H13NO3 = (Na+ • C11H13NO3)
Free energy of reaction
ΔrG° (kJ/mol) | T (K) | Method | Reference |
---|---|---|---|
146. | 0. | CIDC | Feng, Gronert, et al., 1999 |

References

Feng, Gronert, et al., 1999
Feng, W.Y.; Gronert, S.; Lebrilla, C.B.,
Lithium and sodium ion binding energies of N-acetyl and N-glycyl amino acids,
J. Am. Chem. Soc., 1999, 121, 6, 1365, https://doi.org/10.1021/ja983116s
. [all data]