3-(Methylaminomethyl)pyridine
- Formula: C7H10N2
- Molecular weight: 122.1677
- IUPAC Standard InChIKey: MCSAQVGDZLPTBS-UHFFFAOYSA-N
- CAS Registry Number: 20173-04-0
- Chemical structure:

Van Den Dool and Kratz RI, non-polar column, temperature ramp

Column type | Active phase | I | Reference | Comment |
---|---|---|---|---|
Capillary | OV-1 | 1111.4 | Gautzsch and Zinn, 1996 | 8. K/min; Tstart: 35. C; Tend: 300. C |

References

Gautzsch and Zinn, 1996
Gautzsch, R.; Zinn, P.,
Use of incremental models to estimate the retention indexes of aromatic compounds,
Chromatographia, 1996, 43, 3/4, 163-176, https://doi.org/10.1007/BF02292946
. [all data]