1,2-Difluorotetranitroethane
- Formula: C2F2N4O8
- Molecular weight: 246.0402
- IUPAC Standard InChIKey: BDYYJOSEHYEBKF-UHFFFAOYSA-N
- CAS Registry Number: 20165-39-3
- Chemical structure:
View 3d structure (requires JavaScript / HTML 5) - Permanent link for this species. Use this link for bookmarking this species for future reference.

Phase change data

Data compiled as indicated in comments:
ALS - Hussein Y. Afeefy, Joel F. Liebman, and Stephen E. Stein
AC - William E. Acree, Jr., James S. Chickos
Quantity | Value | Units | Method | Reference | Comment |
---|---|---|---|---|---|
ΔvapH° | 62.8 ± 0.8 | kJ/mol | V | Pepekin, Lebedev, et al., 1973 | hf_HF.30H2O=-77.01 kcal/mol; ALS |
Enthalpy of vaporization
ΔvapH (kJ/mol) | Temperature (K) | Method | Reference | Comment |
---|---|---|---|---|
62.8 | 310. | A | Stephenson and Malanowski, 1987 | Based on data from 297. to 323. K. See also Pepekin, Lebedev, et al., 1973, 2.; AC |

Condensed phase thermochemistry data

Data compiled by: Hussein Y. Afeefy, Joel F. Liebman, and Stephen E. Stein
Quantity | Value | Units | Method | Reference | Comment |
---|---|---|---|---|---|
ΔfH°liquid | -415. ± 4.2 | kJ/mol | Ccb | Pepekin, Lebedev, et al., 1973 | hf_HF.30H2O=-77.01 kcal/mol |
Quantity | Value | Units | Method | Reference | Comment |
ΔcH°liquid | -730. ± 3. | kJ/mol | Ccb | Pepekin, Lebedev, et al., 1973 | hf_HF.30H2O=-77.01 kcal/mol |

Gas phase thermochemistry data

Data compiled by: Hussein Y. Afeefy, Joel F. Liebman, and Stephen E. Stein
Quantity | Value | Units | Method | Reference | Comment |
---|---|---|---|---|---|
ΔfH°gas | -352. ± 4.2 | kJ/mol | Ccb | Pepekin, Lebedev, et al., 1973 | hf_HF.30H2O=-77.01 kcal/mol |

References

Pepekin, Lebedev, et al., 1973
Pepekin, V.I.; Lebedev, Yu.A.; Apin, A.Ya.,
Dissociation energies of C-F and C-C bonds in α-fluoronitro derivatives of methane and ethane,
Dokl. Akad. Nauk SSSR, 1973, 208, 153-155. [all data]
Stephenson and Malanowski, 1987
Stephenson, Richard M.; Malanowski, Stanislaw,
Handbook of the Thermodynamics of Organic Compounds, 1987, https://doi.org/10.1007/978-94-009-3173-2
. [all data]
Pepekin, Lebedev, et al., 1973, 2
Pepekin, V.I.; Lebedev, Y.A.; Apin, A.Y.,
Dokl. Phys. Chem., 1973, 208, 35. [all data]