1,1,2-Trifluorotrinitroethane
- Formula: C2F3N3O6
- Molecular weight: 219.0331
- IUPAC Standard InChIKey: YZXMNZPACCLUCJ-UHFFFAOYSA-N
- CAS Registry Number: 20165-38-2
- Chemical structure:
View 3d structure (requires JavaScript / HTML 5) - Permanent link for this species. Use this link for bookmarking this species for future reference.

Gas phase thermochemistry data

Data compiled by: Hussein Y. Afeefy, Joel F. Liebman, and Stephen E. Stein
Quantity | Value | Units | Method | Reference | Comment |
---|---|---|---|---|---|
ΔfH°gas | -601. ± 3. | kJ/mol | Ccb | Pepekin, Lebedev, et al., 1973 | hf_HF.30H2O=-77.01 kcal/mol and hf_CF4=-223.0 kcal/mol |

Condensed phase thermochemistry data

Data compiled by: Hussein Y. Afeefy, Joel F. Liebman, and Stephen E. Stein

Quantity Value Units Method Reference Comment
Δfliquid-659. ± 3.kJ/molCcbPepekin, Lebedev, et al., 1973hf_HF.30H2O=-77.01 kcal/mol and hf_CF4=-223.0 kcal/mol
Quantity Value Units Method Reference Comment
Δcliquid-648. ± 2.kJ/molCcbPepekin, Lebedev, et al., 1973hf_HF.30H2O=-77.01 kcal/mol and hf_CF4=-223.0 kcal/mol

References

Pepekin, Lebedev, et al., 1973
Pepekin, V.I.; Lebedev, Yu.A.; Apin, A.Ya.,
Dissociation energies of C-F and C-C bonds in α-fluoronitro derivatives of methane and ethane,
Dokl. Akad. Nauk SSSR, 1973, 208, 153-155. [all data]