Acetic acid, 2-ethylhydrazide
- Formula: C4H10N2O
- Molecular weight: 102.1350
- IUPAC Standard InChIKey: UIWVQFSAXYWENY-UHFFFAOYSA-N
- CAS Registry Number: 20147-25-5
- Chemical structure:
View 3d structure (requires JavaScript / HTML 5) - Permanent link for this species. Use this link for bookmarking this species for future reference.

Normal alkane RI, non-polar column, temperature ramp

Column type | Active phase | I | Reference | Comment |
---|---|---|---|---|
Capillary | OV-101 | 977. | Zenkevich, 2005 | 25. m/0.20 mm/0.10 μm, N2/He, 6. K/min; Tstart: 50. C; Tend: 250. C |

References

Zenkevich, 2005
Zenkevich, I.G.,
Experimentally measured retention indices., 2005. [all data]