3-Nonene
- Formula: C9H18
- Molecular weight: 126.2392
- IUPAC Standard InChIKey: YCBSHDKATAPNIA-UHFFFAOYSA-N
- CAS Registry Number: 20063-77-8
- Chemical structure:
View 3d structure (requires JavaScript / HTML 5) - Stereoisomers:

Phase change data

Data compiled by: Thermodynamics Research Center, NIST Boulder Laboratories, Chris Muzny director
Quantity | Value | Units | Method | Reference | Comment |
---|---|---|---|---|---|
Tboil | 420.75 | K | N/A | Spengler, 1948 | Uncertainty assigned by TRC = 0.4 K |
Quantity | Value | Units | Method | Reference | Comment |
Tfus | 171. | K | N/A | Spengler, 1948 | Uncertainty assigned by TRC = 2. K |

Normal alkane RI, non-polar column, custom temperature program

View large format table.

Column type Active phase I Reference Comment
CapillaryDB-1896.Ciccioli, Cecinato, et al., 199460. m/0.32 mm/0.25 μm; Program: not specified

References

Spengler, 1948
Spengler, G.,
Unpublished, Inst. Kohleforschung, Prague, Czechosl- ovakia (transmitted by L. L. Newman, U. S, 1948. [all data]