Benzene, 1,1'-(1,2-ethenediyl)bis[2,4,6-trinitro-
- Formula: C14H6N6O12
- Molecular weight: 450.2304
- IUPAC Standard InChIKey: YSIBQULRFXITSW-OWOJBTEDSA-N
- CAS Registry Number: 20062-22-0
- Chemical structure:
View 3d structure (requires JavaScript / HTML 5) - Other names: Stilbene, 2,2',4,4',6,6'-hexanitro-; 1,1'-(1,2-Ethenediyl)bis(2,4,6-trinitrobenzene); 2,2',4,4',6,6'-Hexanitrostilbene; HNS

Gas phase thermochemistry data

Data compiled by: Hussein Y. Afeefy, Joel F. Liebman, and Stephen E. Stein
Quantity | Value | Units | Method | Reference | Comment |
---|---|---|---|---|---|
ΔfH°gas | 56.98 | kcal/mol | Ccb | Marantz and Armstrong, 1968 | see Marantz and Armstrong, 1968, 2 |

Condensed phase thermochemistry data

Data compiled by: Hussein Y. Afeefy, Joel F. Liebman, and Stephen E. Stein

Quantity Value Units Method Reference Comment
Δfsolid16.2 ± 2.5kcal/molCcbRouse, 1976
Δfsolid13.88kcal/molCcbMarantz and Armstrong, 1968see Marantz and Armstrong, 1968, 2
Quantity Value Units Method Reference Comment
Δcsolid-1537.8 ± 1.2kcal/molCcbRouse, 1976
Δcsolid-1535.5 ± 1.1kcal/molCcbMarantz and Armstrong, 1968see Marantz and Armstrong, 1968, 2

References

Marantz and Armstrong, 1968
Marantz, S.; Armstrong, G.T.,
Heats of combustion of trans-stilbene and trans-2,2',4,',6,6'-hexanitrostilbene (HNS) (Correction),
J. Chem. Eng. Data, 1968, 13, 455. [all data]
Marantz and Armstrong, 1968, 2
Marantz, S.; Armstrong, G.T.,
Heats of combustion of trans-stilbene and trans-2,2',4,4',6,6'-hexanitrostilbene (HNS),
J. Chem. Eng. Data, 1968, 13, 118-121. [all data]