Anti-1,2,3,5,6-pentamethyl-4-methylenebicyclo[3.1.0]hex-2-ene
- Formula: C12H18
- Molecular weight: 162.2713
- IUPAC Standard InChIKey: HDCJWTTZLOHNHX-UHFFFAOYSA-N
- CAS Registry Number: 20055-93-0
- Chemical structure:
View 3d structure (requires JavaScript / HTML 5) - Permanent link for this species. Use this link for bookmarking this species for future reference.

Reaction thermochemistry data

Data compiled by: Hussein Y. Afeefy, Joel F. Liebman, and Stephen E. Stein
Individual Reactions
By formula: C12H18 = C12H18
Quantity | Value | Units | Method | Reference | Comment |
---|---|---|---|---|---|
ΔrH° | -179. | kJ/mol | Ciso | Childs and Mulholland, 1983 | liquid phase |

References

Childs and Mulholland, 1983
Childs, R.F.; Mulholland, D.L.,
Thermochemical relationships between some bicyclohexenyl and benzenium cations,
J. Am. Chem. Soc., 1983, 105, 96-99. [all data]