Tetrafluorobis(trifluoromethoxy) sulfur
- Formula: C2F10O2S
- Molecular weight: 278.069
- CAS Registry Number: 2004-38-8

Phase change data

Data compiled by: William E. Acree, Jr., James S. Chickos
Enthalpy of vaporization
ΔvapH (kcal/mol) | Temperature (K) | Method | Reference | Comment |
---|---|---|---|---|
7.15 | 261. | A | Stephenson and Malanowski, 1987 | Based on data from 246. to 302. K. See also Duncan and Cady, 1964. |

References

Stephenson and Malanowski, 1987
Stephenson, Richard M.; Malanowski, Stanislaw,
Handbook of the Thermodynamics of Organic Compounds, 1987, https://doi.org/10.1007/978-94-009-3173-2
. [all data]
Duncan and Cady, 1964
Duncan, Leonard C.; Cady, George H.,
The Preparation and Properties of Trifluoromethoxy Sulfur Pentafluoride [CF 3 OSF 5 ] and cis-Bis(trifluoromethoxy)tetrafluorosulfur(VI) [(CF 3 O) 2 SF 4 ],
Inorg. Chem., 1964, 3, 6, 850-852, https://doi.org/10.1021/ic50016a015
. [all data]