Cyclohexene, 1,4,5-trimethyl-
- Formula: C9H16
- Molecular weight: 124.2233
- IUPAC Standard InChIKey: FNZUANSNHGITHR-UHFFFAOYSA-N
- CAS Registry Number: 20030-32-4
- Chemical structure:
View 3d structure (requires JavaScript / HTML 5) - Stereoisomers:
- Other names: 1,4,5-trimethylcyclohexene

Phase change data

Data compiled by: Thermodynamics Research Center, NIST Boulder Laboratories, Chris Muzny director
Quantity | Value | Units | Method | Reference | Comment |
---|---|---|---|---|---|
Tboil | 418. | K | N/A | Von Auwers, 1920 | Uncertainty assigned by TRC = 5. K |

Normal alkane RI, non-polar column, custom temperature program

Column type | Active phase | I | Reference | Comment |
---|---|---|---|---|
Capillary | Polydimethyl siloxanes | 908. | Zenkevich, Chupalov, et al., 1996 | Program: not specified |
Capillary | Polydimethyl siloxanes | 908. | Zenkevich, Chupalov, et al., 1996 | Program: not specified |

References

Von Auwers, 1920
Von Auwers, K.,
Relation Between Constitution and Physical Properties of Hydroaromatic Compounds,
Justus Liebigs Ann. Chem., 1920, 420, 84-111. [all data]
Zenkevich, Chupalov, et al., 1996
Zenkevich, I.G.; Chupalov, A.A.; Herzschuh, R.,
Correlation of the Increments of Gas Chromatographic Retention Indices with the Differences of Innermolecular Energies of Reagents and Products of Chemical Reactions,
Zh. Org. Khim. (Rus.), 1996, 32, 11, 1685-1691. [all data]