Silicic acid, tetrakis(1-methylethyl) ester
- Formula: C12H28O4Si
- Molecular weight: 264.4338
- IUPAC Standard InChIKey: ZUEKXCXHTXJYAR-UHFFFAOYSA-N
- CAS Registry Number: 1992-48-9
- Chemical structure:
View 3d structure (requires JavaScript / HTML 5) - Other names: Tetrakis(isopropoxy)silane; Isopropyl silicate ((C3H7O)4Si); Silicic acid (H4SiO4), tetraisopropyl ester; Tetra(isopropoxy)silane; Tetraisopropyl orthosilicate; Tetrakis(i-propoxy)silane; Tetrakis(isopropyloxy)silane; Silicon tetraisopropoxide; Silane, tetraisopropoxy-; NSC 252164; Silicic acid (H4SiO4), tetrakis(1-methylethyl) ester; Tetraisopropyl o-silicate; tetrakis(1-methylethyl) orthosilicate

Phase change data

Data compiled by: William E. Acree, Jr., James S. Chickos
Enthalpy of vaporization
ΔvapH (kcal/mol) | Temperature (K) | Reference | Comment |
---|---|---|---|
12.6 | 342. | Thomas, Smith, et al., 2007 | Based on data from 327. to 438. K. |

Kovats' RI, non-polar column, isothermal

Column type | Active phase | Temperature (C) | I | Reference | Comment |
---|---|---|---|---|---|
Packed | Apiezon L | 160. | 915. | Peetre, 1974 | Column length: 3. m |

Normal alkane RI, non-polar column, isothermal

Column type | Active phase | Temperature (C) | I | Reference | Comment |
---|---|---|---|---|---|
Packed | Apieson M | 160. | 915. | Ellren, Peetre, et al., 1974 | Chromosorb G AW DMCS (80-100 mesh) |

References

Thomas, Smith, et al., 2007
Thomas, Leo H.; Smith, Harry; Davies, Gwyn H.,
Vapour pressures, molar entropies of vaporisation and liquid-state conformation of alkoxides,
J. Chem. Technol. Biotechnol., 2007, 30, 1, 476-480, https://doi.org/10.1002/jctb.503300160
. [all data]
Peetre, 1974
Peetre, I.-B.,
Gas chromatographic investigation of organometallic compounds and their carbon analogues. III. A study of Kováts retention indices for tetraalkoxysilanes containing branched alkoxy groups,
J. Chromatogr., 1974, 90, 1, 35-40, https://doi.org/10.1016/S0021-9673(01)94771-5
. [all data]
Ellren, Peetre, et al., 1974
Ellren, O.; Peetre, I.B.; Smith, B.E.F.,
Gas chromatographic investigation of organometallic compounds and their carbon analogues. V. Use of refractive index in conjunction with Kovats retention index for the identification of organosilicon compounds,
J. Chromatogr., 1974, 93, 2, 383-392, https://doi.org/10.1016/S0021-9673(01)85402-9
. [all data]