(3-Methoxyphenyl)acetonitrile
- Formula: C9NO
- Molecular weight: 138.1024
- IUPAC Standard InChIKey: LXKNAUOWEJWGTE-UHFFFAOYSA-N
- CAS Registry Number: 19924-43-7
- Chemical structure:
View 3d structure (requires JavaScript / HTML 5) - Other names: (m-Methoxyphenyl)acetonitrile; m-Methoxy benzyl cyanide; Benzeneacetonitrile, 3-methoxy-; 2-(3-Methoxyphenyl)acetonitrile

Gas phase ion energetics data

Data compiled by: John E. Bartmess
De-protonation reactions
C9H8NO- + =
By formula: C9H8NO- + H+ = C9NO
Quantity | Value | Units | Method | Reference | Comment |
---|---|---|---|---|---|
ΔrH° | 349.3 ± 2.5 | kcal/mol | G+TS | Taft and Topsom, 1987 | gas phase |
Quantity | Value | Units | Method | Reference | Comment |
ΔrG° | 342.7 ± 2.0 | kcal/mol | IMRE | Taft and Topsom, 1987 | gas phase |

Reaction thermochemistry data

Data compiled by: John E. Bartmess

Individual Reactions

C9H8NO- + Hydrogen cation = (3-Methoxyphenyl)acetonitrile

By formula: C9H8NO- + H+ = C9NO

Quantity Value Units Method Reference Comment
Δr1461. ± 10.kJ/molG+TSTaft and Topsom, 1987gas phase
Quantity Value Units Method Reference Comment
Δr1434. ± 8.4kJ/molIMRETaft and Topsom, 1987gas phase

References

Taft and Topsom, 1987
Taft, R.W.; Topsom, R.D.,
The Nature and Analysis of Substituent Effects,
Prog. Phys. Org. Chem., 1987, 16, 1. [all data]