Methylphosphonic acid, O-isopropyl-, O-trimethylsilyl-
- Formula: C7H19O3PSi
- Molecular weight: 210.2832
- IUPAC Standard InChIKey: SVOLQKHGSREJLY-UHFFFAOYSA-N
- CAS Registry Number: 199116-08-0
- Chemical structure:
View 3d structure (requires JavaScript / HTML 5) - Other names: Methylphosphonic acid, mono-isopropyl ester, TMS; Isopropyl trimethylsilyl methylphosphonate; Methylphosphonic acid, isopropyl trimethylsilyl ester

Van Den Dool and Kratz RI, non-polar column, temperature ramp

Column type | Active phase | I | Reference | Comment |
---|---|---|---|---|
Capillary | SE-54 | 1116. | Kostiainen, 2000 | 25. m/0.32 mm/0.25 μm, He, 40. C @ 1. min, 10. K/min, 280. C @ 10. min |

Normal alkane RI, non-polar column, temperature ramp

Column type | Active phase | I | Reference | Comment |
---|---|---|---|---|
Capillary | DB-5 | 1110. | Savel'eva, Zenkevich, et al., 2002 | 25. m/0.20 mm/0.33 μm, Helium, 40. C @ 1. min, 5. K/min, 270. C @ 15. min |

Normal alkane RI, non-polar column, custom temperature program

Column type | Active phase | I | Reference | Comment |
---|---|---|---|---|
Capillary | DB-5 | 1110. | Saveljeva, Zenkevich, et al., 2003 | He; Program: not specified |
Capillary | 5 % Phenyl methyl siloxane | 1116. | OPCW, 1997 | Program: not specified |

References

Kostiainen, 2000
Kostiainen, O.,
Gas Chromatography in Screening of Chemicals Related to the Chemical Weapons Convention
in Encyclopedia of Analytical Chemistry, Meyers, R.A., ed(s)., John Wiley Sons Ltd, Chichester, 2000, 963-979. [all data]
Savel'eva, Zenkevich, et al., 2002
Savel'eva, E.I.; Zenkevich, I.G.; Kuznetsova, T.A.; Radilov, A.S.; Pshenichnaya, G.V.,
Investigation of Products of Transformation of Phosphororganic Toxic Substances with Gas Chromatography - Mass Spectrometry,
Rus. Khim. Zh. (Rus.), 2002, 56, 6, 82-91. [all data]
Saveljeva, Zenkevich, et al., 2003
Saveljeva, E.; Zenkevich, I.; Radilov, A.,
Identification of chemical neutralization and products of organophosphorus chemical warfare agents, 2003, retrieved from http://www.shimadzu.com/apps/form.cfm. [all data]
OPCW, 1997
OPCW,
Conference of the States Parties C-I/DEC.64 (22 May 1997), 1997, retrieved from http://www.opcw.org/html/global/cseries/csp1/CIDEC64.html. [all data]