C9H13BrO2
- Formula: C9H13BrO2
- Molecular weight: 233.102
- CAS Registry Number: 1989-50-0

Gas phase ion energetics data

Data compiled by: John E. Bartmess
De-protonation reactions
C9H12BrO2- + = C9H13BrO2
By formula: C9H12BrO2- + H+ = C9H13BrO2
Quantity | Value | Units | Method | Reference | Comment |
---|---|---|---|---|---|
ΔrH° | 1411. ± 9.2 | kJ/mol | G+TS | Koppel, Mishima, et al., 1993 | gas phase |
ΔrH° | 1411. ± 9.2 | kJ/mol | G+TS | Taft and Topsom, 1987 | gas phase; value altered from reference due to change in acidity scale |
Quantity | Value | Units | Method | Reference | Comment |
ΔrG° | 1382. ± 8.4 | kJ/mol | IMRE | Koppel, Mishima, et al., 1993 | gas phase |
ΔrG° | 1382. ± 8.4 | kJ/mol | IMRE | Taft and Topsom, 1987 | gas phase; value altered from reference due to change in acidity scale |

Reaction thermochemistry data

Data compiled by: John E. Bartmess

Individual Reactions

C9H12BrO2- + Hydrogen cation = C9H13BrO2

By formula: C9H12BrO2- + H+ = C9H13BrO2

Quantity Value Units Method Reference Comment
Δr337.3 ± 2.2kcal/molG+TSKoppel, Mishima, et al., 1993gas phase
Δr337.3 ± 2.2kcal/molG+TSTaft and Topsom, 1987gas phase; value altered from reference due to change in acidity scale
Quantity Value Units Method Reference Comment
Δr330.3 ± 2.0kcal/molIMREKoppel, Mishima, et al., 1993gas phase
Δr330.3 ± 2.0kcal/molIMRETaft and Topsom, 1987gas phase; value altered from reference due to change in acidity scale

References

Koppel, Mishima, et al., 1993
Koppel, I.A.; Mishima, M.; Stock, L.M.; Taft, R.W.; Topsom, R.D.,
Acidities of 4-Substituted Benzoic, Bicyclo[2.2.2]Oct-1-yl and Bicyclo[2.2.2]Oct-2-enyl Carboxylic Acids,
J. Phys. Org. Chem., 1993, 6, 12, 685, https://doi.org/10.1002/poc.610061205
. [all data]
Taft and Topsom, 1987
Taft, R.W.; Topsom, R.D.,
The Nature and Analysis of Substituent Effects,
Prog. Phys. Org. Chem., 1987, 16, 1. [all data]