(-)-Myrtenol
- Formula: C10H16O
- Molecular weight: 152.2334
- IUPAC Standard InChIKey: RXBQNMWIQKOSCS-UHFFFAOYSA-N
- CAS Registry Number: 19894-97-4
- Chemical structure:
View 3d structure (requires JavaScript / HTML 5) - Species with the same structure:
- Stereoisomers:
- Other names: Bicyclo[3.1.1]hept-2-ene-2-methanol, 6,6-dimethyl-, (1R)-; (1R)-6,6-dimethylbicyclo[3.1.1]hept-2-ene-2-methanol

Van Den Dool and Kratz RI, non-polar column, custom temperature program

Column type | Active phase | I | Reference | Comment |
---|---|---|---|---|
Capillary | VF-5MS | 1212.8 | Tret'yakov, 2007 | 30. m/0.25 mm/0.25 μm, He; Program: Multi-step temperature program; T(initial)=60C; T(final)=270C |

References

Tret'yakov, 2007
Tret'yakov, K.V.,
Retention Data. NIST Mass Spectrometry Data Center., NIST Mass Spectrometry Data Center, 2007. [all data]