[1R-(1α,2α,3β,5α)]-2,6,6-trimethylbicyclo[3.1.1]heptan-3-ol
- Formula: C10H18O
- Molecular weight: 154.2493
- IUPAC Standard InChIKey: REPVLJRCJUVQFA-MAUMQABQSA-N
- CAS Registry Number: 19889-94-2
- Chemical structure:
View 3d structure (requires JavaScript / HTML 5) - Stereoisomers:
- Other names: Bicyclo[3.1.1]heptan-3-ol, 2,6,6-trimethyl-, [1r-(1α,2α,3β,5α)]-

Gas phase thermochemistry data

Data compiled by: Hussein Y. Afeefy, Joel F. Liebman, and Stephen E. Stein
Quantity | Value | Units | Method | Reference | Comment |
---|---|---|---|---|---|
ΔfH°gas | -188. ± 8.4 | kJ/mol | Ccb | Steele, 1979 |

References

Steele, 1979
Steele, W.V.,
Thermochemically determined ΔH°f(g) values for ketones and alcohols,
Private Communication, University of Stirling, Stirling, Scotland, 1979, 0. [all data]