Lyratol
- Formula: C10H16O
- Molecular weight: 152.2334
- IUPAC Standard InChIKey: NHJXCMQPMLBAMK-RMKNXTFCSA-N
- CAS Registry Number: 19889-92-0
- Chemical structure:
View 3d structure (requires JavaScript / HTML 5) - Permanent link for this species. Use this link for bookmarking this species for future reference.

Normal alkane RI, non-polar column, temperature ramp

Column type | Active phase | I | Reference | Comment |
---|---|---|---|---|
Capillary | HP-5 | 1164. | Collin, Deslauriers, et al., 1993 | 2. K/min; Tstart: 40. C; Tend: 210. C |

References

Collin, Deslauriers, et al., 1993
Collin, G.J.; Deslauriers, H.; Pageau, N.; Gagnon, M.,
Essential oil of Tansy (Tanacetum vulgare L.) of Canadian origin,
J. Essent. Oil Res., 1993, 5, 6, 629-638, https://doi.org/10.1080/10412905.1993.9698296
. [all data]