1,1'-(1,1-dimethyl-1,2-ethanediyl)bisbenzene

Phase change data

Data compiled by: Thermodynamics Research Center, NIST Boulder Laboratories, Chris Muzny director

Quantity Value Units Method Reference Comment
Tboil576.2KN/ACaves, McLaughlin, et al., 1954Uncertainty assigned by TRC = 1.5 K
Tboil559.KN/ADolgov and Larin, 1950Uncertainty assigned by TRC = 8. K
Tboil548.KN/ADolgov and Larin, 1950Uncertainty assigned by TRC = 30. K
Quantity Value Units Method Reference Comment
Tfus239.5KN/ACaves, McLaughlin, et al., 1954Uncertainty assigned by TRC = 2. K

In addition to the Thermodynamics Research Center (TRC) data available from this site, much more physical and chemical property data is available from the following TRC products:

References

Caves, McLaughlin, et al., 1954
Caves, R.M.; McLaughlin, R.L.; Wise, P.H., Dicyclic hydrocarbons: vii synthesis and physical properties of some 1,3- diphenyl- and 1,3-dicyclohexyl-2- alkylpropane hydrocarbons, J. Am. Chem. Soc., 1954, 76, 522. [all data]

Dolgov and Larin, 1950
Dolgov, B.N.; Larin, N.A., Reactions with Aluminum Chloride Obtained According to Radzivanovskii Condensation of Benzene with some Aliphatic Unsaturated Halogen Derivatives and Polyhalogenated Compounds, Zh. Obshch. Khim., 1950, 20, 450. [all data]