1,4-Cyclohexadiene, 1-ethyl-
- Formula: C8H12
- Molecular weight: 108.1809
- IUPAC Standard InChIKey: PUQJLFYISQDJKP-UHFFFAOYSA-N
- CAS Registry Number: 19841-74-8
- Chemical structure:
View 3d structure (requires JavaScript / HTML 5) - Other names: 1-Ethyl-1,4-cyclohexadiene

Reaction thermochemistry data

Data compiled by: Hussein Y. Afeefy, Joel F. Liebman, and Stephen E. Stein
Individual Reactions
By formula: C8H12 = C8H12
Quantity | Value | Units | Method | Reference | Comment |
---|---|---|---|---|---|
ΔrH° | -9.3 ± 1.3 | kJ/mol | Eqk | Taskinen and Nummelin, 1994 | liquid phase; solvent: Dimethylsulfoxide |
By formula: C8H12 = C8H12
Quantity | Value | Units | Method | Reference | Comment |
---|---|---|---|---|---|
ΔrH° | -0.1 ± 0.2 | kJ/mol | Eqk | Taskinen and Nummelin, 1994 | liquid phase; solvent: Dimethylsulfoxide |
By formula: C8H12 = C8H12
Quantity | Value | Units | Method | Reference | Comment |
---|---|---|---|---|---|
ΔrH° | -2.7 ± 1.2 | kJ/mol | Eqk | Taskinen and Nummelin, 1994 | liquid phase; solvent: Dimethylsulfoxide |

Kovats' RI, non-polar column, isothermal

Column type | Active phase | Temperature (C) | I | Reference | Comment |
---|---|---|---|---|---|
Capillary | SE-30 | 130. | 910. | Bredael, 1982 | Column length: 100. m; Column diameter: 0.5 mm |
Capillary | SE-30 | 80. | 900. | Bredael, 1982 | Column length: 100. m; Column diameter: 0.5 mm |

Normal alkane RI, non-polar column, custom temperature program

Column type | Active phase | I | Reference | Comment |
---|---|---|---|---|
Capillary | Squalane | 900. | Chen, 2008 | Program: not specified |
Capillary | OV-1, SE-30, Methyl silicone, SP-2100, OV-101, DB-1, etc. | 900. | Waggott and Davies, 1984 | Hydrogen; Column length: 50. m; Column diameter: 0.32 mm; Program: not specified |

References

Taskinen and Nummelin, 1994
Taskinen, E.; Nummelin, K.,
Relative thermodynamic stabilities of 3-ethylidenecyclohexenes and isomeric ethylcyclohexadienes,
Tetrahedron, 1994, 50, 11693-11698. [all data]
Bredael, 1982
Bredael, P.,
Retention indices of hydrocarbons on SE-30,
J. Hi. Res. Chromatogr. Chromatogr. Comm., 1982, 5, 6, 325-328, https://doi.org/10.1002/jhrc.1240050610
. [all data]
Chen, 2008
Chen, H.-F.,
Quantitative prediction of gas chromatography retention indices with support vector machines, radial basis neutral networks and multiple linear regression,
Anal. Chim. Acta, 2008, 609, 1, 24-36, https://doi.org/10.1016/j.aca.2008.01.003
. [all data]
Waggott and Davies, 1984
Waggott, A.; Davies, I.W.,
Identification of organic pollutants using linear temperature programmed retention indices (LTPRIs) - Part II, 1984, retrieved from http://dwi.defra.gov.uk/research/completed-research/reports/dwi0383.pdf. [all data]