Chloroxuron
- Formula: C15H15ClN2O2
- Molecular weight: 290.745
- IUPAC Standard InChIKey: IVUXTESCPZUGJC-UHFFFAOYSA-N
- CAS Registry Number: 1982-47-4
- Chemical structure:
View 3d structure (requires JavaScript / HTML 5) - Other names: Urea, N'-[4-(4-chlorophenoxy)phenyl]-N,N-dimethyl-; Urea, 3-[p-(p-chlorophenoxy)phenyl]-1,1-dimethyl-; C 1983; Norex; Tenoran; 3-(4-(4-Chloor-fenoxy)-fenyl)-1,1-dimethylureum; 3-(4-(4-Chloro-fenossil)fenil)-1,1-dimetil-urea; N'-4-(p-Chlorophenoxy)phenyl-N,N-dimethylurea; 3-(p-(p-Chlorophenoxy)phenyl)-1,1-dimethylurea; 1-(4-(4-Chloro-phenoxy)phenyl)-3,3-d'methyluree; Chloroxifenidim; 3-(4-(4-Chlor-phenoxy)-phenyl)-1,1-dimethylharnstoff; CIBA 1983; 3-[4-(4-Chlorophenoxy)phenyl]-1,1-dimethylurea; Chloroxyfenidim; Chlorphencarb; Gesamoos; N'-[4-(4-Chlorophenoxy)phenyl]-N,N-dimethylurea

Phase change data

Data compiled as indicated in comments:
TRC - Thermodynamics Research Center, NIST Boulder Laboratories, Chris Muzny director
AC - William E. Acree, Jr., James S. Chickos
Quantity | Value | Units | Method | Reference | Comment |
---|---|---|---|---|---|
Tfus | 425.83 | K | N/A | Donnelly, Drewes, et al., 1990 | Uncertainty assigned by TRC = 0.2 K; TRC |
Tfus | 425.1 | K | N/A | Plato, 1972 | Uncertainty assigned by TRC = 0.2 K; TRC |
Enthalpy of fusion
ΔfusH (kcal/mol) | Temperature (K) | Method | Reference | Comment |
---|---|---|---|---|
8.334 | 425.8 | DSC | Acree, 1991 | See also Donnelly, Drewes, et al., 1990, 2.; AC |

Kovats' RI, non-polar column, temperature ramp

Column type | Active phase | I | Reference | Comment |
---|---|---|---|---|
Capillary | DB-1 | 1895. | Hall, Whitehead, et al., 1986 | He, 6. K/min; Column length: 15. m; Column diameter: 0.25 mm; Tstart: 100. C; Tend: 270. C |
Capillary | DB-5 | 1928. | Hall, Whitehead, et al., 1986 | He, 6. K/min; Column length: 15. m; Column diameter: 0.25 mm; Tstart: 100. C; Tend: 270. C |

References

Donnelly, Drewes, et al., 1990
Donnelly, J.R.; Drewes, L.A.; Johnson, R.L.; Munslow, W.D.; Knapp, K.K.; Sovocool, G.W.,
Purity and heat of fusion data for environmental standards as determined by differential scanning calorimetry,
Thermochim. Acta, 1990, 167, 2, 155, https://doi.org/10.1016/0040-6031(90)80476-F
. [all data]
Plato, 1972
Plato, C.,
DSC as a general method for determining purity and heat of fusion of high-purity organic chemicals,
Anal. Chem., 1972, 44, 1531. [all data]
Acree, 1991
Acree, William E.,
Thermodynamic properties of organic compounds: enthalpy of fusion and melting point temperature compilation,
Thermochimica Acta, 1991, 189, 1, 37-56, https://doi.org/10.1016/0040-6031(91)87098-H
. [all data]
Donnelly, Drewes, et al., 1990, 2
Donnelly, J.R.; Drewes, L.A.; Johnson, R.L.; Munslow, W.D.; Knapp, K.K.; Sovocool, G.W.,
Purity and heat of fusion data for environmental standards as determined by differential scanning calorimetry,
Thermochimica Acta, 1990, 167, 2, 155-187, https://doi.org/10.1016/0040-6031(90)80476-F
. [all data]
Hall, Whitehead, et al., 1986
Hall, G.L.; Whitehead, W.E.; Mourer, C.R.; Shibamoto, T.,
A new gas chromatographic retention index for pesticides and related compounds,
J. Hi. Res. Chromatogr. Chromatogr. Comm., 1986, 9, 5, 266-271, https://doi.org/10.1002/jhrc.1240090503
. [all data]