Tantalum, pentakis(dimethylamino)-

Phase change data

Data compiled by: José A. Martinho Simões

Quantity Value Units Method Reference Comment
Δsub89. ± 10.kJ/molRSCAdedeji, Cavell, et al., 1979

Gas phase thermochemistry data

Data compiled by: José A. Martinho Simões

Quantity Value Units Method Reference Comment
Δfgas-56.9 ± 3.5kcal/molReviewMartinho Simões

References

Adedeji, Cavell, et al., 1979
Adedeji, F.A.; Cavell, K.J.; Cavell, S.; Connor, J.A.; Skinner, H.A.; Zafarani-Moattar, M.T., J. Chem. Soc. Faraday Trans. 1, 1979, 75, 603. [all data]