Allyl radical
- Formula: C3H5
- Molecular weight: 41.0718
- IUPAC Standard InChIKey: RMRFFCXPLWYOOY-UHFFFAOYSA-N
- CAS Registry Number: 1981-80-2
- Chemical structure:
View 3d structure (requires JavaScript / HTML 5) - Permanent link for this species. Use this link for bookmarking this species for future reference.

Gas phase thermochemistry data

Quantity | Value | Units | Method | Reference | Comment |
---|---|---|---|---|---|
ΔfH°gas | 171. ± 3. | kJ/mol | N/A | Tsang, 1996 |

References

Tsang, 1996
Tsang, W.,
Heats of Formation of Organic Free Radicals by Kinetic Methods
in Energetics of Organic Free Radicals, Martinho Simoes, J.A.; Greenberg, A.; Liebman, J.F., eds., Blackie Academic and Professional, London, 1996, 22-58. [all data]