1,14-Tetradecanediol
- Formula: C14H30O2
- Molecular weight: 230.3868
- IUPAC Standard InChIKey: XLKZJJVNBQCVIX-UHFFFAOYSA-N
- CAS Registry Number: 19812-64-7
- Chemical structure:
View 3d structure (requires JavaScript / HTML 5) - Other names: tetradecamethylene glycol; tetradecane-1,14-diol

Phase change data

Data compiled by: William E. Acree, Jr., James S. Chickos
Enthalpy of fusion
ΔfusH (kJ/mol) | Temperature (K) | Method | Reference |
---|---|---|---|
61.9 | 360.4 | DSC | Ogawa and Nakamura, 1999 |

Van Den Dool and Kratz RI, non-polar column, custom temperature program

Column type | Active phase | I | Reference | Comment |
---|---|---|---|---|
Capillary | DB-1 | 1924. | Peng, 2000 | 15. m/0.53 mm/1. μm, He; Program: 40C(3min) => 8C/min => 200(1min) => 5C/min => 300C(25min) |

References

Ogawa and Nakamura, 1999
Ogawa, Yoshihiro; Nakamura, Naotake,
Phase Transitions of Pure Long-Chain .ALPHA.,.OMEGA.-Alkanediols from C13 to C24.,
Bull. Chem. Soc. Jpn., 1999, 72, 5, 943-946, https://doi.org/10.1246/bcsj.72.943
. [all data]
Peng, 2000
Peng, C.T.,
Prediction of retention indices. V. Influence of electronic effects and column polarity on retention index,
J. Chromatogr. A, 2000, 903, 1-2, 117-143, https://doi.org/10.1016/S0021-9673(00)00901-8
. [all data]