4-Heptyn-2-ol
- Formula: C7H12O
- Molecular weight: 112.1696
- IUPAC Standard InChIKey: CXVIEBMEWKSONY-UHFFFAOYSA-N
- CAS Registry Number: 19781-81-8
- Chemical structure:
View 3d structure (requires JavaScript / HTML 5) - Other names: hept-4-yn-2-ol

Phase change data

Data compiled by: Robert L. Brown and Stephen E. Stein
Reduced pressure boiling point
Tboil (K) | Pressure (bar) | Reference |
---|---|---|
341. | 0.019 | Farchan Laboratories, 1990 |

References

Farchan Laboratories, 1990
Farchan Laboratories,
Research Chemicals Catalog, Farchan Laboratories, Gainesville, FL, 1990, 91. [all data]