3-Ethyl-3-phenyl-1-pentene
- Formula: C13H18
- Molecular weight: 174.2820
- IUPAC Standard InChIKey: JUYLWJTWBDJSLZ-UHFFFAOYSA-N
- CAS Registry Number: 19781-34-1
- Chemical structure:
View 3d structure (requires JavaScript / HTML 5) - Permanent link for this species. Use this link for bookmarking this species for future reference.

Phase change data

Data compiled by: Thermodynamics Research Center, NIST Boulder Laboratories, Chris Muzny director
Quantity | Value | Units | Method | Reference | Comment |
---|---|---|---|---|---|
Tboil | 503.13 | K | N/A | Anonymous, 1952 | Uncertainty assigned by TRC = 0.6 K |

References

Anonymous, 1952
Anonymous, R.,
, Physical Properties of Chemical Substances, Dow Chemical Co., 1952. [all data]