2,3-Dimethyl-2-octene
- Formula: C10H20
- Molecular weight: 140.2658
- IUPAC Standard InChIKey: ZFMOZNIUEPVNCV-UHFFFAOYSA-N
- CAS Registry Number: 19781-18-1
- Chemical structure:
View 3d structure (requires JavaScript / HTML 5) - Other names: n-C5H11C(CH3)=C(CH3)2; 2-Octene, 2,3-dimethyl

Phase change data

Data compiled by: Thermodynamics Research Center, NIST Boulder Laboratories, Chris Muzny director
Quantity | Value | Units | Method | Reference | Comment |
---|---|---|---|---|---|
Tboil | 442.3 | K | N/A | Levina, Fainzil'berg, et al., 1950 | Uncertainty assigned by TRC = 1.5 K |
Tboil | 441.9 | K | N/A | Gibbons, 1941 | Uncertainty assigned by TRC = 2. K |
Tboil | 441.9 | K | N/A | Cline, 1939 | Uncertainty assigned by TRC = 1.5 K |
Quantity | Value | Units | Method | Reference | Comment |
Tfus | 187. | K | N/A | Gibbons, 1941 | Uncertainty assigned by TRC = 2. K |
Tfus | 187.2 | K | N/A | Cline, 1939 | Uncertainty assigned by TRC = 2. K |

Gas phase ion energetics data

Data compiled as indicated in comments:
LLK - Sharon G. Lias, Rhoda D. Levin, and Sherif A. Kafafi
Ionization energy determinations
IE (eV) | Method | Reference | Comment |
---|---|---|---|
8.132 ± 0.005 | PE | Masclet, Grosjean, et al., 1973 | LLK |

Kovats' RI, non-polar column, isothermal

Column type | Active phase | Temperature (C) | I | Reference | Comment |
---|---|---|---|---|---|
Capillary | OV-101 | 40. | 959. | Laub and Purnell, 1988 | |
Capillary | OV-101 | 60. | 960. | Laub and Purnell, 1988 | |
Capillary | OV-101 | 80. | 962. | Laub and Purnell, 1988 |

Normal alkane RI, non-polar column, temperature ramp

Column type | Active phase | I | Reference | Comment |
---|---|---|---|---|
Capillary | OV-101 | 961. | Orav, Kailas, et al., 1999 | 50. m/0.20 mm/0.50 μm, Helium, 30. C @ 6. min, 1. K/min; Tend: 100. C |

References

Levina, Fainzil'berg, et al., 1950
Levina, R.Ya.; Fainzil'berg, A.A.; Itenberg, R.V.,
Synthesis of Hydrocarbons. 2,3-Dimethyl-1,3-butadiene in the synthesis of 2,3-Dimethyl-2-alkenes and 2,3-Dimethylalkanes,
Dokl. Akad. Nauk SSSR, 1950, 75, 39. [all data]
Gibbons, 1941
Gibbons, L.C.,
, Ph.D. Thesis, Ohio State Univ., Columbus, OH, 1941. [all data]
Cline, 1939
Cline, E.T.,
The Synthesis of Type III and Type V Olefins from Dimethylbutadien- monohydrobromide, Ph.D. Dissertation, Ohio State Univ., Columbus, OH, 1939. [all data]