5-Ethyl-3-nonanol
- Formula: C11H24O
- Molecular weight: 172.3077
- IUPAC Standard InChIKey: DWMKGYOHPSYFCS-UHFFFAOYSA-N
- CAS Registry Number: 19780-71-3
- Chemical structure:
View 3d structure (requires JavaScript / HTML 5) - Permanent link for this species. Use this link for bookmarking this species for future reference.

Phase change data

Data compiled by: Thermodynamics Research Center, NIST Boulder Laboratories, Chris Muzny director
Quantity | Value | Units | Method | Reference | Comment |
---|---|---|---|---|---|
Tboil | 498.55 | K | N/A | Anonymous, 1958 |

References

Anonymous, 1958
Anonymous, X.,
Am. Pet. Inst. Res. Proj. 50, 1958, Unpublished, 1958. [all data]