3-Ethyl-4-methyl-2-pentene
- Formula: C8H16
- Molecular weight: 112.2126
- IUPAC Standard InChIKey: DSTFDBMUTNIZGD-UHFFFAOYSA-N
- CAS Registry Number: 19780-68-8
- Chemical structure:
View 3d structure (requires JavaScript / HTML 5) - Stereoisomers:

Phase change data

Data compiled by: Thermodynamics Research Center, NIST Boulder Laboratories, Chris Muzny director
Quantity | Value | Units | Method | Reference | Comment |
---|---|---|---|---|---|
Tboil | 387.3 | K | N/A | Rudel, 1938 | Uncertainty assigned by TRC = 1.5 K |

References

Rudel, 1938
Rudel, H.W.,
, Ph.D. Dissertation, Ohio State Univ., Columbus, OH, 1938. [all data]