2-Pentanol, 3-ethyl-2-methyl-
- Formula: C8H18O
- Molecular weight: 130.2279
- IUPAC Standard InChIKey: FRUMTAZIGSJVOJ-UHFFFAOYSA-N
- CAS Registry Number: 19780-63-3
- Chemical structure:
View 3d structure (requires JavaScript / HTML 5) - Other names: 3-Ethyl-2-methyl-2-pentanol

Phase change data

Data compiled by: Thermodynamics Research Center, NIST Boulder Laboratories, Chris Muzny director
Quantity | Value | Units | Method | Reference | Comment |
---|---|---|---|---|---|
Tboil | 429.15 | K | N/A | Clarke, 1908 | Uncertainty assigned by TRC = 3. K |

References

Clarke, 1908
Clarke, L.,
Diethylisopropylmethane.,
Am. Chem. J., 1908, 39, 572. [all data]