Rubicene-
- Formula: C26H14
- Molecular weight: 326.3894
- IUPAC Standard InChIKey: FMKFBRKHHLWKDB-UHFFFAOYSA-N
- CAS Registry Number: 197-61-5
- Chemical structure:
View 3d structure (requires JavaScript / HTML 5) - Permanent link for this species. Use this link for bookmarking this species for future reference.

Gas phase thermochemistry data

Data compiled by: Glushko Thermocenter, Russian Academy of Sciences, Moscow
Constant pressure heat capacity of gas
Cp,gas (J/mol*K) | Temperature (K) | Reference | Comment |
---|---|---|---|
60.20 | 50. | Dorofeeva O.V., 1989 | These statistically calculated values were obtained using force field approximation for polycyclic aromatic hydrocarbons to estimate the needed vibrational frequencies (see also [ Dorofeeva O.V., 1986, Moiseeva N.F., 1990]). These functions are reproduced in the reference book [ Frenkel M., 1994]. |
104.13 | 100. | ||
153.87 | 150. | ||
209.01 | 200. | ||
294.41 | 273.15 | ||
323.5 ± 7.0 | 298.15 | ||
325.66 | 300. | ||
434.31 | 400. | ||
524.85 | 500. | ||
597.10 | 600. | ||
654.54 | 700. | ||
700.71 | 800. | ||
738.32 | 900. | ||
769.35 | 1000. | ||
795.21 | 1100. | ||
816.93 | 1200. | ||
835.31 | 1300. | ||
850.97 | 1400. | ||
864.38 | 1500. |

Phase change data

Data compiled by: Thermodynamics Research Center, NIST Boulder Laboratories, Chris Muzny director
Quantity | Value | Units | Method | Reference | Comment |
---|---|---|---|---|---|
Tfus | 581. | K | N/A | Bergmann, Fischer, et al., 1953 | Uncertainty assigned by TRC = 4. K |

References

Dorofeeva O.V., 1989
Dorofeeva O.V.,
Thermodynamic Properties of Gaseous Polycyclic Aromatic Hydrocarbons Containing Five-Membered Rings. Institute for High Temperatures, USSR Academy of Sciences, Preprint No.1-263 (in Russian), Moscow, 1989. [all data]
Dorofeeva O.V., 1986
Dorofeeva O.V.,
On calculation of thermodynamic properties of polycyclic aromatic hydrocarbons,
Thermochim. Acta, 1986, 102, 59-66. [all data]
Moiseeva N.F., 1990
Moiseeva N.F.,
Group additivity scheme for calculating the chemical thermodynamic properties of gaseous polycyclic aromatic hydrocarbons containing five-membered rings,
Thermochim. Acta, 1990, 168, 179-186. [all data]
Frenkel M., 1994
Frenkel M.,
Thermodynamics of Organic Compounds in the Gas State, Vol. I, II, Thermodynamics Research Center, College Station, Texas, 1994, 1994. [all data]
Bergmann, Fischer, et al., 1953
Bergmann, E.D.; Fischer, E.; Jaffe, J.H.,
Exalted Distortion Polarizations of Some COlored Hydrocarbons,
J. Am. Chem. Soc., 1953, 75, 3230-3. [all data]