Decanenitrile
- Formula: C10H19N
- Molecular weight: 153.2646
- IUPAC Standard InChIKey: HBZDPWBWBJMYRY-UHFFFAOYSA-N
- CAS Registry Number: 1975-78-6
- Chemical structure:
View 3d structure (requires JavaScript / HTML 5) - Other names: Caprinitrile; Decanonitrile; n-Nonyl cyanide; n-Decanenitrile; 1-Cyanononane; 1-Decanenitrile; Nitrile 10 D; Nonyl cyanide; NSC 6085

Gas phase thermochemistry data

Data compiled by: Hussein Y. Afeefy, Joel F. Liebman, and Stephen E. Stein
Quantity | Value | Units | Method | Reference | Comment |
---|---|---|---|---|---|
ΔfH°gas | -21.9 ± 0.43 | kcal/mol | Ccr | Stridh, Sunner, et al., 1977 | Possible typo error corrected |

Condensed phase thermochemistry data

Data compiled by: Hussein Y. Afeefy, Joel F. Liebman, and Stephen E. Stein
Quantity | Value | Units | Method | Reference | Comment |
---|---|---|---|---|---|
ΔfH°liquid | -37.86 ± 0.43 | kcal/mol | Ccr | Stridh, Sunner, et al., 1977 | Possible typo error corrected |
Quantity | Value | Units | Method | Reference | Comment |
ΔcH°liquid | -1551.6 ± 0.29 | kcal/mol | Ccr | Stridh, Sunner, et al., 1977 | Possible typo error corrected |

Phase change data

Data compiled as indicated in comments:
TRC - Thermodynamics Research Center, NIST Boulder Laboratories, Chris Muzny director
AC - William E. Acree, Jr., James S. Chickos
ALS - Hussein Y. Afeefy, Joel F. Liebman, and Stephen E. Stein
DRB - Donald R. Burgess, Jr.
Quantity | Value | Units | Method | Reference | Comment |
---|---|---|---|---|---|
Tboil | 516.9 | K | N/A | Deffet, 1931 | Uncertainty assigned by TRC = 1.5 K; TRC |
Quantity | Value | Units | Method | Reference | Comment |
Tfus | 258.69 | K | N/A | Dorinson and Ralston, 1944 | Uncertainty assigned by TRC = 0.3 K; TRC |
Tfus | 258.69 | K | N/A | Hoerr, Binkerd, et al., 1944 | Uncertainty assigned by TRC = 0.3 K; TRC |
Tfus | 255.25 | K | N/A | Deffet, 1931 | Uncertainty assigned by TRC = 2. K; TRC |
Quantity | Value | Units | Method | Reference | Comment |
ΔvapH° | 15.98 | kcal/mol | N/A | Majer and Svoboda, 1985 | |
ΔvapH° | 15.8 ± 0.1 | kcal/mol | GS | Emel'yanenko, Verevkin, et al., 2005 | Based on data from 295. to 326. K.; AC |
ΔvapH° | 15.98 ± 0.088 | kcal/mol | C | Stridh, Sunner, et al., 1977 | Possible typo error corrected; ALS |
ΔvapH° | 16.0 | kcal/mol | N/A | Stridh, Sunner, et al., 1977 | DRB |
ΔvapH° | 16.0 ± 0.1 | kcal/mol | C | Stridh, Sunner, et al., 1977 | AC |
Enthalpy of vaporization
ΔvapH (kcal/mol) | Temperature (K) | Method | Reference | Comment |
---|---|---|---|---|
13.9 | 396. | A | Stephenson and Malanowski, 1987 | Based on data from 381. to 519. K.; AC |
13.8 | 396. | EB | Meyer, Renner, et al., 1971 | Based on data from 381. to 431. K.; AC |
13.0 | 446. | EB | Meyer, Renner, et al., 1971 | Based on data from 431. to 518. K.; AC |

References

Stridh, Sunner, et al., 1977
Stridh, G.; Sunner, S.; Svensson, C.,
Enthalpies of combustion, vaporization, and formation of some alkanenitriles, and the CH2-increment in the alkanenitrile series,
J. Chem. Thermodyn., 1977, 9, 1005-1010. [all data]
Deffet, 1931
Deffet, L.,
The Freezing Points of Organic Compounds XIII. Compounds With Seven Eight, Nine or Ten Carbon Atoms,
Bull. Soc. Chim. Belg., 1931, 40, 385-402. [all data]
Dorinson and Ralston, 1944
Dorinson, A.; Ralston, A.W.,
Refractive Indices of the Normal Saturated Aliphatic Nitriles. ammonia,
J. Am. Chem. Soc., 1944, 66, 361. [all data]
Hoerr, Binkerd, et al., 1944
Hoerr, C.W.; Binkerd, E.F.; Pool, W.O.; Ralston, A.W.,
Solubilities of High-Molecular-Weight Normal Aliphatic Nitriles.,
J. Org. Chem., 1944, 9, 68-80. [all data]
Majer and Svoboda, 1985
Majer, V.; Svoboda, V.,
Enthalpies of Vaporization of Organic Compounds: A Critical Review and Data Compilation, Blackwell Scientific Publications, Oxford, 1985, 300. [all data]
Emel'yanenko, Verevkin, et al., 2005
Emel'yanenko, Vladimir N.; Verevkin, Sergey P.; Koutek, Bohumir; Doubsky, Jan,
Vapour pressures and enthalpies of vapourization of a series of the linear aliphatic nitriles,
The Journal of Chemical Thermodynamics, 2005, 37, 1, 73-81, https://doi.org/10.1016/j.jct.2004.08.004
. [all data]
Stephenson and Malanowski, 1987
Stephenson, Richard M.; Malanowski, Stanislaw,
Handbook of the Thermodynamics of Organic Compounds, 1987, https://doi.org/10.1007/978-94-009-3173-2
. [all data]
Meyer, Renner, et al., 1971
Meyer, Edwin F.; Renner, Terrence A.; Stec, Kenneth S.,
Cohesive energies in polar organic liquids. II. n-Alkane nitriles and the 1-chloro alkanes,
J. Phys. Chem., 1971, 75, 5, 642-648, https://doi.org/10.1021/j100675a008
. [all data]